BDBM6263 8-(oxiran-2-ylmethyl)-2-(phenylamino)-7H,8H-pyrido[2,3-d]pyrimidin-7-one::8-Oxiranylmethyl-2-phenylamino-8H-pyrido[2,3-d]pyrimidin-7-one::N8 Pyrido[2,3-d]pyrimidin-7-one deriv. 55
SMILES: O=c1ccc2cnc(Nc3ccccc3)nc2n1CC1CO1
InChI Key: InChIKey=WCVKOGFMMGNKBV-UHFFFAOYSA-N
Data: 1 IC50
Activity Spreadsheet -- Enzyme Inhibition Constant Data from BindingDB
Found 1 hit for monomerid = 6263
Trg + Lig
Ki
nM
ΔG°
kcal/mole
IC50
nM
Kd
nM
EC50/IC50
nM
koff
s-1
kon
M-1s-1
pHTemp
°C
Cyclin-Dependent Kinase 4 (CDK4)
(Homo sapiens (Human))
BDBM6263
(8-(oxiran-2-ylmethyl)-2-(phenylamino)-7H,8H-pyrido...)
Show SMILES O=c1ccc2cnc(Nc3ccccc3)nc2n1CC1CO1
Show InChI InChI=1S/C16H14N4O2/c21-14-7-6-11-8-17-16(18-12-4-2-1-3-5-12)19-15(11)20(14)9-13-10-22-13/h1-8,13H,9-10H2,(H,17,18,19)
NCI pathway
Reactome pathway
n/an/a 5.00E+3n/an/an/an/an/an/a
Parke-Davis Pharmaceutical Research
Assay Description
The enzyme was assayed with substrate GST- retinoblastoma in the presence of 25 uM ATP/[gamma-32P] ATP. IC50 is the inhibitor concentration, which in...
J Med Chem 43: 4606-16 (2000)
Article DOI: 10.1021/jm000271k
BindingDB Entry DOI: 10.7270/Q25B00N4