BDBM6276 8-Cyclopentyl-2-[4-(4-methylpiperazin-1-yl)phenylamino]-8H-pyrido[2,3-d]pyrimidin-7-one::8-cyclopentyl-2-{[4-(4-methylpiperazin-1-yl)phenyl]amino}-7H,8H-pyrido[2,3-d]pyrimidin-7-one::FRAX019::N8 Pyrido[2,3-d]pyrimidin-7-one deriv. 68::Pyrido[2,3-d]pyrimidin-7-one 1
SMILES: CN1CCN(CC1)c1ccc(Nc2ncc3ccc(=O)n(C4CCCC4)c3n2)cc1
InChI Key: InChIKey=FUBDWXAVMGEMPP-UHFFFAOYSA-N
Data: 7 IC50
Activity Spreadsheet -- Enzyme Inhibition Constant Data from BindingDB
Found 7 hits for monomerid = 6276
Trg + Lig
Ki
nM
ΔG°
kcal/mole
IC50
nM
Kd
nM
EC50/IC50
nM
koff
s-1
kon
M-1s-1
pHTemp
°C
Cyclin-Dependent Kinase 4 (CDK4)
(Homo sapiens (Human))
BDBM6276
(8-Cyclopentyl-2-[4-(4-methylpiperazin-1-yl)phenyla...)
Show SMILES CN1CCN(CC1)c1ccc(Nc2ncc3ccc(=O)n(C4CCCC4)c3n2)cc1
Show InChI InChI=1S/C23H28N6O/c1-27-12-14-28(15-13-27)19-9-7-18(8-10-19)25-23-24-16-17-6-11-21(30)29(22(17)26-23)20-4-2-3-5-20/h6-11,16,20H,2-5,12-15H2,1H3,(H,24,25,26)
NCI pathway
Reactome pathway
n/an/a 9n/an/an/an/an/an/a
Parke-Davis Pharmaceutical Research
Assay Description
The enzyme was assayed with substrate GST- retinoblastoma in the presence of 25 uM ATP/[gamma-32P] ATP. IC50 is the inhibitor concentration, which in...
J Med Chem 43: 4606-16 (2000)
Article DOI: 10.1021/jm000271k
BindingDB Entry DOI: 10.7270/Q25B00N4
Cyclin-Dependent Kinase 4 (CDK4)
(Homo sapiens (Human))
BDBM6276
(8-Cyclopentyl-2-[4-(4-methylpiperazin-1-yl)phenyla...)
Show SMILES CN1CCN(CC1)c1ccc(Nc2ncc3ccc(=O)n(C4CCCC4)c3n2)cc1
Show InChI InChI=1S/C23H28N6O/c1-27-12-14-28(15-13-27)19-9-7-18(8-10-19)25-23-24-16-17-6-11-21(30)29(22(17)26-23)20-4-2-3-5-20/h6-11,16,20H,2-5,12-15H2,1H3,(H,24,25,26)
NCI pathway
Reactome pathway
n/an/a 7n/an/an/an/a7.425
Pfizer
Assay Description
The enzyme was assayed with substrate GST- retinoblastoma in the presence of 25 uM ATP/[gamma-32P] ATP. IC50 is the inhibitor concentration, which in...
J Med Chem 48: 2371-87 (2005)
Article DOI: 10.1021/jm049355+
BindingDB Entry DOI: 10.7270/Q2S46Q5B
Cyclin-Dependent Kinase 2 (CDK2)
(Homo sapiens (Human))
BDBM6276
(8-Cyclopentyl-2-[4-(4-methylpiperazin-1-yl)phenyla...)
Show SMILES CN1CCN(CC1)c1ccc(Nc2ncc3ccc(=O)n(C4CCCC4)c3n2)cc1
Show InChI InChI=1S/C23H28N6O/c1-27-12-14-28(15-13-27)19-9-7-18(8-10-19)25-23-24-16-17-6-11-21(30)29(22(17)26-23)20-4-2-3-5-20/h6-11,16,20H,2-5,12-15H2,1H3,(H,24,25,26)
NCI pathway
Reactome pathway
n/an/a 14n/an/an/an/an/an/a
Pfizer
Assay Description
The enzyme was assayed with substrate GST- retinoblastoma in the presence of 12 uM ATP/[gamma-32P] ATP. IC50 is the inhibitor concentration, which in...
J Med Chem 48: 2371-87 (2005)
Article DOI: 10.1021/jm049355+
BindingDB Entry DOI: 10.7270/Q2S46Q5B
CDK2/CycE
(Homo sapiens (Human))
BDBM6276
(8-Cyclopentyl-2-[4-(4-methylpiperazin-1-yl)phenyla...)
Show SMILES CN1CCN(CC1)c1ccc(Nc2ncc3ccc(=O)n(C4CCCC4)c3n2)cc1
Show InChI InChI=1S/C23H28N6O/c1-27-12-14-28(15-13-27)19-9-7-18(8-10-19)25-23-24-16-17-6-11-21(30)29(22(17)26-23)20-4-2-3-5-20/h6-11,16,20H,2-5,12-15H2,1H3,(H,24,25,26)
n/an/a 39n/an/an/an/an/an/a
University of Tours
Curated by ChEMBL
Assay Description
Inhibition of CDK2/Cyclin E (unknown origin)
Eur J Med Chem 108: 701-19 (2016)
BindingDB Entry DOI: 10.7270/Q22J6DQD
p21-Activated kinase 1 (PAK1)
(Homo sapiens (Human))
BDBM6276
(8-Cyclopentyl-2-[4-(4-methylpiperazin-1-yl)phenyla...)
Show SMILES CN1CCN(CC1)c1ccc(Nc2ncc3ccc(=O)n(C4CCCC4)c3n2)cc1
Show InChI InChI=1S/C23H28N6O/c1-27-12-14-28(15-13-27)19-9-7-18(8-10-19)25-23-24-16-17-6-11-21(30)29(22(17)26-23)20-4-2-3-5-20/h6-11,16,20H,2-5,12-15H2,1H3,(H,24,25,26)
n/an/a 483n/an/an/an/an/an/a
The Scripps Research Institute
Assay Description
IC50 values were determined using a 10 concentration point, non-radioactive, functional assay that employs a fluorescence-based, coupled enzyme forma...
J Biol Chem 288: 29105-14 (2013)
Article DOI: 10.1074/jbc.M113.510933
BindingDB Entry DOI: 10.7270/Q2B27T4S
Serine/threonine-protein kinase PAK 4
(Homo sapiens (Human))
BDBM6276
(8-Cyclopentyl-2-[4-(4-methylpiperazin-1-yl)phenyla...)
Show SMILES CN1CCN(CC1)c1ccc(Nc2ncc3ccc(=O)n(C4CCCC4)c3n2)cc1
Show InChI InChI=1S/C23H28N6O/c1-27-12-14-28(15-13-27)19-9-7-18(8-10-19)25-23-24-16-17-6-11-21(30)29(22(17)26-23)20-4-2-3-5-20/h6-11,16,20H,2-5,12-15H2,1H3,(H,24,25,26)
Reactome pathway
n/an/a 580n/an/an/an/an/an/a
The Scripps Research Institute
Assay Description
IC50 values were determined using a 10 concentration point, non-radioactive, functional assay that employs a fluorescence-based, coupled enzyme forma...
J Biol Chem 288: 29105-14 (2013)
Article DOI: 10.1074/jbc.M113.510933
BindingDB Entry DOI: 10.7270/Q2B27T4S
CDK2/CycE
(Homo sapiens (Human))
BDBM6276
(8-Cyclopentyl-2-[4-(4-methylpiperazin-1-yl)phenyla...)
Show SMILES CN1CCN(CC1)c1ccc(Nc2ncc3ccc(=O)n(C4CCCC4)c3n2)cc1
Show InChI InChI=1S/C23H28N6O/c1-27-12-14-28(15-13-27)19-9-7-18(8-10-19)25-23-24-16-17-6-11-21(30)29(22(17)26-23)20-4-2-3-5-20/h6-11,16,20H,2-5,12-15H2,1H3,(H,24,25,26)
n/an/a 39n/an/an/an/an/an/a
Pfizer
Assay Description
The enzyme was assayed with substrate GST- retinoblastoma in the presence of 12 uM ATP/[gamma-32P] ATP. IC50 is the inhibitor concentration, which in...
J Med Chem 48: 2371-87 (2005)
Article DOI: 10.1021/jm049355+
BindingDB Entry DOI: 10.7270/Q2S46Q5B