BDBM6285 8-Cyclopentyl-2-(5-piperazin-1-yl-pyridin-2-ylamino)-8H-pyrido[2,3-d]pyrimidin-7-one Hydrochloride::8-cyclopentyl-2-{[5-(piperazin-1-yl)pyridin-2-yl]amino}-7H,8H-pyrido[2,3-d]pyrimidin-7-one::Pyrido-[2,3-d]-pyrimidin-7-one 20
SMILES: O=c1ccc2cnc(Nc3ccc(cn3)N3CCNCC3)nc2n1C1CCCC1
InChI Key: InChIKey=IEQUHIKSZOVGIM-UHFFFAOYSA-N
Data: 2 IC50
PDB links: 1 PDB ID contains this monomer as substructures. 1 PDB ID contains inhibitors having a similarity of 90% to this monomer.
Activity Spreadsheet -- Enzyme Inhibition Constant Data from BindingDB
Found 2 hits for monomerid = 6285
Trg + Lig
Ki
nM
ΔG°
kcal/mole
IC50
nM
Kd
nM
EC50/IC50
nM
koff
s-1
kon
M-1s-1
pHTemp
°C
Cyclin-Dependent Kinase 2 (CDK2)
(Homo sapiens (Human))
BDBM6285
(8-Cyclopentyl-2-(5-piperazin-1-yl-pyridin-2-ylamin...)
Show SMILES O=c1ccc2cnc(Nc3ccc(cn3)N3CCNCC3)nc2n1C1CCCC1
Show InChI InChI=1S/C21H25N7O/c29-19-8-5-15-13-24-21(26-20(15)28(19)16-3-1-2-4-16)25-18-7-6-17(14-23-18)27-11-9-22-10-12-27/h5-8,13-14,16,22H,1-4,9-12H2,(H,23,24,25,26)
NCI pathway
Reactome pathway
n/an/a 2.50E+3n/an/an/an/an/an/a
Pfizer
Assay Description
The enzyme was assayed with substrate GST- retinoblastoma in the presence of 12 uM ATP/[gamma-32P] ATP. IC50 is the inhibitor concentration, which in...
J Med Chem 48: 2388-406 (2005)
Article DOI: 10.1021/jm049354h
BindingDB Entry DOI: 10.7270/Q21J97Z9
Cyclin-Dependent Kinase 4 (CDK4)
(Homo sapiens (Human))
BDBM6285
(8-Cyclopentyl-2-(5-piperazin-1-yl-pyridin-2-ylamin...)
Show SMILES O=c1ccc2cnc(Nc3ccc(cn3)N3CCNCC3)nc2n1C1CCCC1
Show InChI InChI=1S/C21H25N7O/c29-19-8-5-15-13-24-21(26-20(15)28(19)16-3-1-2-4-16)25-18-7-6-17(14-23-18)27-11-9-22-10-12-27/h5-8,13-14,16,22H,1-4,9-12H2,(H,23,24,25,26)
NCI pathway
Reactome pathway
n/an/a 15n/an/an/an/a7.425
Pfizer
Assay Description
The enzyme was assayed with substrate GST- retinoblastoma in the presence of 25 uM ATP/[gamma-32P] ATP. IC50 is the inhibitor concentration, which in...
J Med Chem 48: 2388-406 (2005)
Article DOI: 10.1021/jm049354h
BindingDB Entry DOI: 10.7270/Q21J97Z9