BDBM6326 6-Acetyl-8-cyclopentyl-5-methyl-2-(5-morpholin-4-yl-pyridin-2-ylamino)-8H-pyrido[2,3-d]pyrimidin-7-one::8-cyclopentyl-6-acetyl-5-methyl-2-{[5-(morpholin-4-yl)pyridin-2-yl]amino}-7H,8H-pyrido[2,3-d]pyrimidin-7-one::Pyrido-[2,3-d]-pyrimidin-7-one 60
SMILES: CC(=O)c1c(C)c2cnc(Nc3ccc(cn3)N3CCOCC3)nc2n(C2CCCC2)c1=O
InChI Key: InChIKey=GGNIULHSXFVFEY-UHFFFAOYSA-N
Data: 2 IC50
Activity Spreadsheet -- Enzyme Inhibition Constant Data from BindingDB
Found 2 hits for monomerid = 6326
Trg + Lig
Ki
nM
ΔG°
kcal/mole
IC50
nM
Kd
nM
EC50/IC50
nM
koff
s-1
kon
M-1s-1
pHTemp
°C
Cyclin-Dependent Kinase 2 (CDK2)
(Homo sapiens (Human))
BDBM6326
(6-Acetyl-8-cyclopentyl-5-methyl-2-(5-morpholin-4-y...)
Show SMILES CC(=O)c1c(C)c2cnc(Nc3ccc(cn3)N3CCOCC3)nc2n(C2CCCC2)c1=O
Show InChI InChI=1S/C24H28N6O3/c1-15-19-14-26-24(27-20-8-7-18(13-25-20)29-9-11-33-12-10-29)28-22(19)30(17-5-3-4-6-17)23(32)21(15)16(2)31/h7-8,13-14,17H,3-6,9-12H2,1-2H3,(H,25,26,27,28)
NCI pathway
Reactome pathway
n/an/a>5.00E+3n/an/an/an/an/an/a
Pfizer
Assay Description
The enzyme was assayed with substrate GST- retinoblastoma in the presence of 12 uM ATP/[gamma-32P] ATP. IC50 is the inhibitor concentration, which in...
J Med Chem 48: 2388-406 (2005)
Article DOI: 10.1021/jm049354h
BindingDB Entry DOI: 10.7270/Q21J97Z9
Cyclin-Dependent Kinase 4 (CDK4)
(Homo sapiens (Human))
BDBM6326
(6-Acetyl-8-cyclopentyl-5-methyl-2-(5-morpholin-4-y...)
Show SMILES CC(=O)c1c(C)c2cnc(Nc3ccc(cn3)N3CCOCC3)nc2n(C2CCCC2)c1=O
Show InChI InChI=1S/C24H28N6O3/c1-15-19-14-26-24(27-20-8-7-18(13-25-20)29-9-11-33-12-10-29)28-22(19)30(17-5-3-4-6-17)23(32)21(15)16(2)31/h7-8,13-14,17H,3-6,9-12H2,1-2H3,(H,25,26,27,28)
NCI pathway
Reactome pathway
n/an/a 4n/an/an/an/an/an/a
Pfizer
Assay Description
The enzyme was assayed with substrate GST- retinoblastoma in the presence of 25 uM ATP/[gamma-32P] ATP. IC50 is the inhibitor concentration, which in...
J Med Chem 48: 2388-406 (2005)
Article DOI: 10.1021/jm049354h
BindingDB Entry DOI: 10.7270/Q21J97Z9