null
SMILES: Oc1ccc2cnc(Nc3ccc(cc3)N3CCOCC3)nc2c1C1CCCC1
InChI Key: InChIKey=PVZBVJXRCNTAAW-UHFFFAOYSA-N
Activity Spreadsheet -- Enzyme Inhibition Constant Data from BindingDB
Found 4 hits for monomerid = 6346
Trg + Lig
Ki
nM
ΔG°
kcal/mole
IC50
nM
Kd
nM
EC50/IC50
nM
koff
s-1
kon
M-1s-1
pHTemp
°C
Cyclin-dependent kinase/G2/mitotic-specific cyclin- 1
(Homo sapiens (Human))
BDBM6346
(2-Aminoquinazoline 25 | 8-cyclopentyl-2-{[4-(morph...)
Show SMILES Oc1ccc2cnc(Nc3ccc(cc3)N3CCOCC3)nc2c1C1CCCC1
Show InChI InChI=1S/C23H26N4O2/c28-20-10-5-17-15-24-23(26-22(17)21(20)16-3-1-2-4-16)25-18-6-8-19(9-7-18)27-11-13-29-14-12-27/h5-10,15-16,28H,1-4,11-14H2,(H,24,25,26)
Reactome pathway
n/an/a 1.94E+3n/an/an/an/an/an/a
NAEJA Pharmaceutical Inc.
Assay Description
The enzyme was assayed with substrate GST- retinoblastoma in the presence of 12 uM ATP/[gamma-32P] ATP. IC50 is the inhibitor concentration, which in...
Bioorg Med Chem Lett 15: 3881-5 (2005)
Article DOI: 10.1016/j.bmcl.2005.05.131
BindingDB Entry DOI: 10.7270/Q2WW7FVW
Cyclin-dependent kinase 4/G1/S-specific cyclin-D1 [L188C]
(Homo sapiens (Human))
BDBM6346
(2-Aminoquinazoline 25 | 8-cyclopentyl-2-{[4-(morph...)
Show SMILES Oc1ccc2cnc(Nc3ccc(cc3)N3CCOCC3)nc2c1C1CCCC1
Show InChI InChI=1S/C23H26N4O2/c28-20-10-5-17-15-24-23(26-22(17)21(20)16-3-1-2-4-16)25-18-6-8-19(9-7-18)27-11-13-29-14-12-27/h5-10,15-16,28H,1-4,11-14H2,(H,24,25,26)
NCI pathway
Reactome pathway
n/an/a 3n/an/an/an/an/an/a
NAEJA Pharmaceutical Inc.
Assay Description
The enzyme was assayed with substrate GST- retinoblastoma in the presence of 25 uM ATP/[gamma-32P] ATP. IC50 is the inhibitor concentration, which in...
Bioorg Med Chem Lett 15: 3881-5 (2005)
Article DOI: 10.1016/j.bmcl.2005.05.131
BindingDB Entry DOI: 10.7270/Q2WW7FVW
Cyclin-dependent kinase 2/G1/S-specific cyclin-E1
(Homo sapiens (Human))
BDBM6346
(2-Aminoquinazoline 25 | 8-cyclopentyl-2-{[4-(morph...)
Show SMILES Oc1ccc2cnc(Nc3ccc(cc3)N3CCOCC3)nc2c1C1CCCC1
Show InChI InChI=1S/C23H26N4O2/c28-20-10-5-17-15-24-23(26-22(17)21(20)16-3-1-2-4-16)25-18-6-8-19(9-7-18)27-11-13-29-14-12-27/h5-10,15-16,28H,1-4,11-14H2,(H,24,25,26)
n/an/a 635n/an/an/an/an/an/a
NAEJA Pharmaceutical Inc.
Assay Description
The enzyme was assayed with substrate GST- retinoblastoma in the presence of 12 uM ATP/[gamma-32P] ATP. IC50 is the inhibitor concentration, which i...
Bioorg Med Chem Lett 15: 3881-5 (2005)
Article DOI: 10.1016/j.bmcl.2005.05.131
BindingDB Entry DOI: 10.7270/Q2WW7FVW
Cyclin-A2/Cyclin-dependent kinase 2
(Homo sapiens (Human))
BDBM6346
(2-Aminoquinazoline 25 | 8-cyclopentyl-2-{[4-(morph...)
Show SMILES Oc1ccc2cnc(Nc3ccc(cc3)N3CCOCC3)nc2c1C1CCCC1
Show InChI InChI=1S/C23H26N4O2/c28-20-10-5-17-15-24-23(26-22(17)21(20)16-3-1-2-4-16)25-18-6-8-19(9-7-18)27-11-13-29-14-12-27/h5-10,15-16,28H,1-4,11-14H2,(H,24,25,26)
NCI pathway
Reactome pathway
n/an/a 180n/an/an/an/an/an/a
NAEJA Pharmaceutical Inc.
Assay Description
The enzyme was assayed with substrate GST- retinoblastoma in the presence of 12 uM ATP/[gamma-32P] ATP. IC50 is the inhibitor concentration, which in...
Bioorg Med Chem Lett 15: 3881-5 (2005)
Article DOI: 10.1016/j.bmcl.2005.05.131
BindingDB Entry DOI: 10.7270/Q2WW7FVW