null
SMILES: Oc1ccc2cnc(Nc3ccc(cc3)N3CCNCC3)nc2c1C1CCCC1
InChI Key: InChIKey=TWOLZYGLMTWBFU-UHFFFAOYSA-N
Activity Spreadsheet -- Enzyme Inhibition Constant Data from BindingDB
Found 5 hits for monomerid = 6347
Trg + Lig
Ki
nM
ΔG°
kcal/mole
IC50
nM
Kd
nM
EC50/IC50
nM
koff
s-1
kon
M-1s-1
pHTemp
°C
Cyclin-dependent kinase/G2/mitotic-specific cyclin- 1
(Homo sapiens (Human))
BDBM6347
(2-Aminoquinazoline 26 | 8-cyclopentyl-2-{[4-(piper...)
Show SMILES Oc1ccc2cnc(Nc3ccc(cc3)N3CCNCC3)nc2c1C1CCCC1
Show InChI InChI=1S/C23H27N5O/c29-20-10-5-17-15-25-23(27-22(17)21(20)16-3-1-2-4-16)26-18-6-8-19(9-7-18)28-13-11-24-12-14-28/h5-10,15-16,24,29H,1-4,11-14H2,(H,25,26,27)
Reactome pathway
n/an/a 30n/an/an/an/an/an/a
NAEJA Pharmaceutical Inc.
Assay Description
The enzyme was assayed with substrate GST- retinoblastoma in the presence of 12 uM ATP/[gamma-32P] ATP. IC50 is the inhibitor concentration, which in...
Bioorg Med Chem Lett 15: 3881-5 (2005)
Article DOI: 10.1016/j.bmcl.2005.05.131
BindingDB Entry DOI: 10.7270/Q2WW7FVW
Cyclin-A2/Cyclin-dependent kinase 2
(Homo sapiens (Human))
BDBM6347
(2-Aminoquinazoline 26 | 8-cyclopentyl-2-{[4-(piper...)
Show SMILES Oc1ccc2cnc(Nc3ccc(cc3)N3CCNCC3)nc2c1C1CCCC1
Show InChI InChI=1S/C23H27N5O/c29-20-10-5-17-15-25-23(27-22(17)21(20)16-3-1-2-4-16)26-18-6-8-19(9-7-18)28-13-11-24-12-14-28/h5-10,15-16,24,29H,1-4,11-14H2,(H,25,26,27)
NCI pathway
Reactome pathway
n/an/a 82n/an/an/an/an/an/a
NAEJA Pharmaceutical Inc.
Assay Description
The enzyme was assayed with substrate GST- retinoblastoma in the presence of 12 uM ATP/[gamma-32P] ATP. IC50 is the inhibitor concentration, which in...
Bioorg Med Chem Lett 15: 3881-5 (2005)
Article DOI: 10.1016/j.bmcl.2005.05.131
BindingDB Entry DOI: 10.7270/Q2WW7FVW
Cyclin-dependent kinase 2/G1/S-specific cyclin-E1
(Homo sapiens (Human))
BDBM6347
(2-Aminoquinazoline 26 | 8-cyclopentyl-2-{[4-(piper...)
Show SMILES Oc1ccc2cnc(Nc3ccc(cc3)N3CCNCC3)nc2c1C1CCCC1
Show InChI InChI=1S/C23H27N5O/c29-20-10-5-17-15-25-23(27-22(17)21(20)16-3-1-2-4-16)26-18-6-8-19(9-7-18)28-13-11-24-12-14-28/h5-10,15-16,24,29H,1-4,11-14H2,(H,25,26,27)
n/an/a 324n/an/an/an/an/an/a
University of Tours
Curated by ChEMBL
Assay Description
Inhibition of CDK2/Cyclin E (unknown origin)
Eur J Med Chem 108: 701-19 (2016)
BindingDB Entry DOI: 10.7270/Q22J6DQD
Cyclin-dependent kinase 4/G1/S-specific cyclin-D1 [L188C]
(Homo sapiens (Human))
BDBM6347
(2-Aminoquinazoline 26 | 8-cyclopentyl-2-{[4-(piper...)
Show SMILES Oc1ccc2cnc(Nc3ccc(cc3)N3CCNCC3)nc2c1C1CCCC1
Show InChI InChI=1S/C23H27N5O/c29-20-10-5-17-15-25-23(27-22(17)21(20)16-3-1-2-4-16)26-18-6-8-19(9-7-18)28-13-11-24-12-14-28/h5-10,15-16,24,29H,1-4,11-14H2,(H,25,26,27)
NCI pathway
Reactome pathway
n/an/a 1n/an/an/an/an/an/a
NAEJA Pharmaceutical Inc.
Assay Description
The enzyme was assayed with substrate GST- retinoblastoma in the presence of 25 uM ATP/[gamma-32P] ATP. IC50 is the inhibitor concentration, which in...
Bioorg Med Chem Lett 15: 3881-5 (2005)
Article DOI: 10.1016/j.bmcl.2005.05.131
BindingDB Entry DOI: 10.7270/Q2WW7FVW
Cyclin-dependent kinase 2/G1/S-specific cyclin-E1
(Homo sapiens (Human))
BDBM6347
(2-Aminoquinazoline 26 | 8-cyclopentyl-2-{[4-(piper...)
Show SMILES Oc1ccc2cnc(Nc3ccc(cc3)N3CCNCC3)nc2c1C1CCCC1
Show InChI InChI=1S/C23H27N5O/c29-20-10-5-17-15-25-23(27-22(17)21(20)16-3-1-2-4-16)26-18-6-8-19(9-7-18)28-13-11-24-12-14-28/h5-10,15-16,24,29H,1-4,11-14H2,(H,25,26,27)
n/an/a 320n/an/an/an/an/an/a
NAEJA Pharmaceutical Inc.
Assay Description
The enzyme was assayed with substrate GST- retinoblastoma in the presence of 12 uM ATP/[gamma-32P] ATP. IC50 is the inhibitor concentration, which i...
Bioorg Med Chem Lett 15: 3881-5 (2005)
Article DOI: 10.1016/j.bmcl.2005.05.131
BindingDB Entry DOI: 10.7270/Q2WW7FVW