null
SMILES: Oc1ccc2cnc(Nc3ccc(N4CCNCC4)c(F)c3)nc2c1C1CCCC1
InChI Key: InChIKey=RWHWILFMZJUQKK-UHFFFAOYSA-N
Activity Spreadsheet -- Enzyme Inhibition Constant Data from BindingDB
Found 4 hits for monomerid = 6348
Trg + Lig
Ki
nM
ΔG°
kcal/mole
IC50
nM
Kd
nM
EC50/IC50
nM
koff
s-1
kon
M-1s-1
pHTemp
°C
Cyclin-dependent kinase/G2/mitotic-specific cyclin- 1
(Homo sapiens (Human))
BDBM6348
(2-Aminoquinazoline 27 | 8-cyclopentyl-2-{[3-fluoro...)
Show SMILES Oc1ccc2cnc(Nc3ccc(N4CCNCC4)c(F)c3)nc2c1C1CCCC1
Show InChI InChI=1S/C23H26FN5O/c24-18-13-17(6-7-19(18)29-11-9-25-10-12-29)27-23-26-14-16-5-8-20(30)21(22(16)28-23)15-3-1-2-4-15/h5-8,13-15,25,30H,1-4,9-12H2,(H,26,27,28)
Reactome pathway
n/an/a 761n/an/an/an/an/an/a
NAEJA Pharmaceutical Inc.
Assay Description
The enzyme was assayed with substrate GST- retinoblastoma in the presence of 12 uM ATP/[gamma-32P] ATP. IC50 is the inhibitor concentration, which in...
Bioorg Med Chem Lett 15: 3881-5 (2005)
Article DOI: 10.1016/j.bmcl.2005.05.131
BindingDB Entry DOI: 10.7270/Q2WW7FVW
Cyclin-dependent kinase 4/G1/S-specific cyclin-D1 [L188C]
(Homo sapiens (Human))
BDBM6348
(2-Aminoquinazoline 27 | 8-cyclopentyl-2-{[3-fluoro...)
Show SMILES Oc1ccc2cnc(Nc3ccc(N4CCNCC4)c(F)c3)nc2c1C1CCCC1
Show InChI InChI=1S/C23H26FN5O/c24-18-13-17(6-7-19(18)29-11-9-25-10-12-29)27-23-26-14-16-5-8-20(30)21(22(16)28-23)15-3-1-2-4-15/h5-8,13-15,25,30H,1-4,9-12H2,(H,26,27,28)
NCI pathway
Reactome pathway
n/an/a 1n/an/an/an/an/an/a
NAEJA Pharmaceutical Inc.
Assay Description
The enzyme was assayed with substrate GST- retinoblastoma in the presence of 25 uM ATP/[gamma-32P] ATP. IC50 is the inhibitor concentration, which in...
Bioorg Med Chem Lett 15: 3881-5 (2005)
Article DOI: 10.1016/j.bmcl.2005.05.131
BindingDB Entry DOI: 10.7270/Q2WW7FVW
Cyclin-dependent kinase 2/G1/S-specific cyclin-E1
(Homo sapiens (Human))
BDBM6348
(2-Aminoquinazoline 27 | 8-cyclopentyl-2-{[3-fluoro...)
Show SMILES Oc1ccc2cnc(Nc3ccc(N4CCNCC4)c(F)c3)nc2c1C1CCCC1
Show InChI InChI=1S/C23H26FN5O/c24-18-13-17(6-7-19(18)29-11-9-25-10-12-29)27-23-26-14-16-5-8-20(30)21(22(16)28-23)15-3-1-2-4-15/h5-8,13-15,25,30H,1-4,9-12H2,(H,26,27,28)
n/an/a 270n/an/an/an/an/an/a
NAEJA Pharmaceutical Inc.
Assay Description
The enzyme was assayed with substrate GST- retinoblastoma in the presence of 12 uM ATP/[gamma-32P] ATP. IC50 is the inhibitor concentration, which i...
Bioorg Med Chem Lett 15: 3881-5 (2005)
Article DOI: 10.1016/j.bmcl.2005.05.131
BindingDB Entry DOI: 10.7270/Q2WW7FVW
Cyclin-A2/Cyclin-dependent kinase 2
(Homo sapiens (Human))
BDBM6348
(2-Aminoquinazoline 27 | 8-cyclopentyl-2-{[3-fluoro...)
Show SMILES Oc1ccc2cnc(Nc3ccc(N4CCNCC4)c(F)c3)nc2c1C1CCCC1
Show InChI InChI=1S/C23H26FN5O/c24-18-13-17(6-7-19(18)29-11-9-25-10-12-29)27-23-26-14-16-5-8-20(30)21(22(16)28-23)15-3-1-2-4-15/h5-8,13-15,25,30H,1-4,9-12H2,(H,26,27,28)
NCI pathway
Reactome pathway
n/an/a 112n/an/an/an/an/an/a
NAEJA Pharmaceutical Inc.
Assay Description
The enzyme was assayed with substrate GST- retinoblastoma in the presence of 12 uM ATP/[gamma-32P] ATP. IC50 is the inhibitor concentration, which in...
Bioorg Med Chem Lett 15: 3881-5 (2005)
Article DOI: 10.1016/j.bmcl.2005.05.131
BindingDB Entry DOI: 10.7270/Q2WW7FVW