BDBM635 (2R,4S)-2-[(R)-(benzylcarbamoyl)(1-phenylacetamido)methyl]-N-(3-{[(2R,4S)-2-[(R)-(benzylcarbamoyl)(1-phenylacetamido)methyl]-5,5-dimethyl-1,3-thiazolidin-4-yl]formamido}propyl)-5,5-dimethyl-1,3-thiazolidine-4-carboxamide::CHEMBL318844::Penicillin Et(NH)2 Sym dimer ::penicillin deriv. 48
SMILES: [H][C@]1(N[C@@H](C(=O)NCCCNC(=O)[C@@H]2N[C@]([H])(SC2(C)C)[C@H](NC(=O)Cc2ccccc2)C(=O)NCc2ccccc2)C(C)(C)S1)[C@H](NC(=O)Cc1ccccc1)C(=O)NCc1ccccc1
InChI Key: InChIKey=XMIJDZJXXSLMTK-WATWFJIKSA-N
Data: 3 IC50
PDB links: 1 PDB ID contains inhibitors having a similarity of 90% to this monomer.
Activity Spreadsheet -- Enzyme Inhibition Constant Data from BindingDB
Found 3 hits for monomerid = 635
Trg + Lig
Ki
nM
ΔG°
kcal/mole
IC50
nM
Kd
nM
EC50/IC50
nM
koff
s-1
kon
M-1s-1
pHTemp
°C
HIV-1 Protease
(Human immunodeficiency virus type 1)
BDBM635
((2R,4S)-2-[(R)-(benzylcarbamoyl)(1-phenylacetamido...)
Show SMILES [H][C@]1(N[C@@H](C(=O)NCCCNC(=O)[C@@H]2N[C@]([H])(SC2(C)C)[C@H](NC(=O)Cc2ccccc2)C(=O)NCc2ccccc2)C(C)(C)S1)[C@H](NC(=O)Cc1ccccc1)C(=O)NCc1ccccc1 |r|
Show InChI InChI=1S/C49H60N8O6S2/c1-48(2)40(56-46(64-48)38(42(60)52-30-34-22-13-7-14-23-34)54-36(58)28-32-18-9-5-10-19-32)44(62)50-26-17-27-51-45(63)41-49(3,4)65-47(57-41)39(43(61)53-31-35-24-15-8-16-25-35)55-37(59)29-33-20-11-6-12-21-33/h5-16,18-25,38-41,46-47,56-57H,17,26-31H2,1-4H3,(H,50,62)(H,51,63)(H,52,60)(H,53,61)(H,54,58)(H,55,59)/t38-,39-,40+,41+,46-,47-/m1/s1
n/an/a 540n/an/an/an/a6.037
Glaxo Group Research Ltd.
Assay Description
IC50 values were obtained by assaying the enzyme against the synthetic substrate peptide KQGTVSFNFPQIT, which was tritiated at the proline residue, a...
J Med Chem 36: 3129-36 (1993)
Article DOI: 10.1021/jm00073a012
BindingDB Entry DOI: 10.7270/Q20P0X6C
Human immunodeficiency virus type 1 protease
(Human immunodeficiency virus type 1)
BDBM635
((2R,4S)-2-[(R)-(benzylcarbamoyl)(1-phenylacetamido...)
Show SMILES [H][C@]1(N[C@@H](C(=O)NCCCNC(=O)[C@@H]2N[C@]([H])(SC2(C)C)[C@H](NC(=O)Cc2ccccc2)C(=O)NCc2ccccc2)C(C)(C)S1)[C@H](NC(=O)Cc1ccccc1)C(=O)NCc1ccccc1 |r|
Show InChI InChI=1S/C49H60N8O6S2/c1-48(2)40(56-46(64-48)38(42(60)52-30-34-22-13-7-14-23-34)54-36(58)28-32-18-9-5-10-19-32)44(62)50-26-17-27-51-45(63)41-49(3,4)65-47(57-41)39(43(61)53-31-35-24-15-8-16-25-35)55-37(59)29-33-20-11-6-12-21-33/h5-16,18-25,38-41,46-47,56-57H,17,26-31H2,1-4H3,(H,50,62)(H,51,63)(H,52,60)(H,53,61)(H,54,58)(H,55,59)/t38-,39-,40+,41+,46-,47-/m1/s1
n/an/a 540n/an/an/an/an/an/a
TBA
Curated by ChEMBL
Assay Description
The compound was tested in vitro for its inhibitory activity against HIV-1 Proteinase activity
Bioorg Med Chem Lett 3: 503-508 (1993)
Article DOI: 10.1016/S0960-894X(01)81216-6
BindingDB Entry DOI: 10.7270/Q2GH9HXV
Human immunodeficiency virus type 1 protease
(Human immunodeficiency virus type 1)
BDBM635
((2R,4S)-2-[(R)-(benzylcarbamoyl)(1-phenylacetamido...)
Show SMILES [H][C@]1(N[C@@H](C(=O)NCCCNC(=O)[C@@H]2N[C@]([H])(SC2(C)C)[C@H](NC(=O)Cc2ccccc2)C(=O)NCc2ccccc2)C(C)(C)S1)[C@H](NC(=O)Cc1ccccc1)C(=O)NCc1ccccc1 |r|
Show InChI InChI=1S/C49H60N8O6S2/c1-48(2)40(56-46(64-48)38(42(60)52-30-34-22-13-7-14-23-34)54-36(58)28-32-18-9-5-10-19-32)44(62)50-26-17-27-51-45(63)41-49(3,4)65-47(57-41)39(43(61)53-31-35-24-15-8-16-25-35)55-37(59)29-33-20-11-6-12-21-33/h5-16,18-25,38-41,46-47,56-57H,17,26-31H2,1-4H3,(H,50,62)(H,51,63)(H,52,60)(H,53,61)(H,54,58)(H,55,59)/t38-,39-,40+,41+,46-,47-/m1/s1
n/an/a 540n/an/an/an/an/an/a
Glaxo Research and Development Limited
Curated by ChEMBL
Assay Description
In vitro inhibitory activity against HIV proteinase
J Med Chem 37: 3707-16 (1994)
BindingDB Entry DOI: 10.7270/Q2V40T88