null
SMILES: Cc1c(Cl)c(=O)n(C2CCCC2)c2nc(Nc3ccc(cc3)N3CCNCC3)ncc12
InChI Key: InChIKey=MSXZBEHSDIOJQX-UHFFFAOYSA-N
Activity Spreadsheet -- Enzyme Inhibition Constant Data from BindingDB
Found 4 hits for monomerid = 6381
Trg + Lig
Ki
nM
ΔG°
kcal/mole
IC50
nM
Kd
nM
EC50/IC50
nM
koff
s-1
kon
M-1s-1
pHTemp
°C
Cyclin-dependent kinase 4/G1/S-specific cyclin-D1 [L188C]
(Homo sapiens (Human))
BDBM6381
(6-Chloro-8-cyclopentyl-5-methyl-2-(4-piperazin-1-y...)
Show SMILES Cc1c(Cl)c(=O)n(C2CCCC2)c2nc(Nc3ccc(cc3)N3CCNCC3)ncc12
Show InChI InChI=1S/C23H27ClN6O/c1-15-19-14-26-23(27-16-6-8-17(9-7-16)29-12-10-25-11-13-29)28-21(19)30(22(31)20(15)24)18-4-2-3-5-18/h6-9,14,18,25H,2-5,10-13H2,1H3,(H,26,27,28)
NCI pathway
Reactome pathway
n/an/a 16n/an/an/an/an/an/a
Pfizer
Assay Description
The enzyme was assayed with substrate GST- retinoblastoma in the presence of 25 uM ATP/[gamma-32P] ATP. IC50 is the inhibitor concentration, which in...
J Med Chem 48: 2371-87 (2005)
Article DOI: 10.1021/jm049355+
BindingDB Entry DOI: 10.7270/Q2S46Q5B
Cyclin-dependent kinase 2/G1/S-specific cyclin-E1
(Homo sapiens (Human))
BDBM6381
(6-Chloro-8-cyclopentyl-5-methyl-2-(4-piperazin-1-y...)
Show SMILES Cc1c(Cl)c(=O)n(C2CCCC2)c2nc(Nc3ccc(cc3)N3CCNCC3)ncc12
Show InChI InChI=1S/C23H27ClN6O/c1-15-19-14-26-23(27-16-6-8-17(9-7-16)29-12-10-25-11-13-29)28-21(19)30(22(31)20(15)24)18-4-2-3-5-18/h6-9,14,18,25H,2-5,10-13H2,1H3,(H,26,27,28)
n/an/a 1.50E+3n/an/an/an/an/an/a
Pfizer
Assay Description
The enzyme was assayed with substrate GST- retinoblastoma in the presence of 12 uM ATP/[gamma-32P] ATP. IC50 is the inhibitor concentration, which in...
J Med Chem 48: 2371-87 (2005)
Article DOI: 10.1021/jm049355+
BindingDB Entry DOI: 10.7270/Q2S46Q5B
Cyclin-A2/Cyclin-dependent kinase 2
(Homo sapiens (Human))
BDBM6381
(6-Chloro-8-cyclopentyl-5-methyl-2-(4-piperazin-1-y...)
Show SMILES Cc1c(Cl)c(=O)n(C2CCCC2)c2nc(Nc3ccc(cc3)N3CCNCC3)ncc12
Show InChI InChI=1S/C23H27ClN6O/c1-15-19-14-26-23(27-16-6-8-17(9-7-16)29-12-10-25-11-13-29)28-21(19)30(22(31)20(15)24)18-4-2-3-5-18/h6-9,14,18,25H,2-5,10-13H2,1H3,(H,26,27,28)
NCI pathway
Reactome pathway
n/an/a 1.63E+3n/an/an/an/an/an/a
Pfizer
Assay Description
The enzyme was assayed with substrate GST- retinoblastoma in the presence of 12 uM ATP/[gamma-32P] ATP. IC50 is the inhibitor concentration, which in...
J Med Chem 48: 2371-87 (2005)
Article DOI: 10.1021/jm049355+
BindingDB Entry DOI: 10.7270/Q2S46Q5B
Cyclin-dependent kinase/G2/mitotic-specific cyclin- 1
(Homo sapiens (Human))
BDBM6381
(6-Chloro-8-cyclopentyl-5-methyl-2-(4-piperazin-1-y...)
Show SMILES Cc1c(Cl)c(=O)n(C2CCCC2)c2nc(Nc3ccc(cc3)N3CCNCC3)ncc12
Show InChI InChI=1S/C23H27ClN6O/c1-15-19-14-26-23(27-16-6-8-17(9-7-16)29-12-10-25-11-13-29)28-21(19)30(22(31)20(15)24)18-4-2-3-5-18/h6-9,14,18,25H,2-5,10-13H2,1H3,(H,26,27,28)
Reactome pathway
n/an/a>5.00E+3n/an/an/an/an/an/a
Pfizer
Assay Description
The enzyme was assayed with substrate GST- retinoblastoma in the presence of 12 uM ATP/[gamma-32P] ATP. IC50 is the inhibitor concentration, which in...
J Med Chem 48: 2371-87 (2005)
Article DOI: 10.1021/jm049355+
BindingDB Entry DOI: 10.7270/Q2S46Q5B