BDBM6402 N-(5-{6-[(3-chlorophenyl)amino]pyrazin-2-yl}pyridin-3-yl)-2-methoxyacetamide::N-{5-[6-(3-Chloro-phenylamino)-pyrazin-2-yl]-pyridin-3-yl}-2-methoxy-acetamide::Pyrazine-Pyridine Biheteroaryl 45
SMILES: COCC(=O)Nc1cncc(c1)-c1cncc(Nc2cccc(Cl)c2)n1
InChI Key: InChIKey=JJEKRZADDFLKDS-UHFFFAOYSA-N
Data: 2 IC50
Activity Spreadsheet -- Enzyme Inhibition Constant Data from BindingDB
Found 2 hits for monomerid = 6402
Trg + Lig
Ki
nM
ΔG°
kcal/mole
IC50
nM
Kd
nM
EC50/IC50
nM
koff
s-1
kon
M-1s-1
pHTemp
°C
VEGFR-2 (KDR)
(Rattus norvegicus (rat))
BDBM6402
(N-(5-{6-[(3-chlorophenyl)amino]pyrazin-2-yl}pyridi...)
Show SMILES COCC(=O)Nc1cncc(c1)-c1cncc(Nc2cccc(Cl)c2)n1
Show InChI InChI=1S/C18H16ClN5O2/c1-26-11-18(25)23-15-5-12(7-20-8-15)16-9-21-10-17(24-16)22-14-4-2-3-13(19)6-14/h2-10H,11H2,1H3,(H,22,24)(H,23,25)
n/an/a 303n/an/an/an/an/an/a
Johnson & Johnson Pharmaceutical
Assay Description
The enzyme was assayed with a biotinylated peptide substrate and test compounds in the presence of 5 uM ATP/[gamma-33P]ATP in a streptavidin coated F...
J Med Chem 48: 4892-909 (2005)
Article DOI: 10.1021/jm058205b
BindingDB Entry DOI: 10.7270/Q2NC5ZD5
Cyclin-Dependent Kinase 1 (CDK1)
(Homo sapiens (Human))
BDBM6402
(N-(5-{6-[(3-chlorophenyl)amino]pyrazin-2-yl}pyridi...)
Show SMILES COCC(=O)Nc1cncc(c1)-c1cncc(Nc2cccc(Cl)c2)n1
Show InChI InChI=1S/C18H16ClN5O2/c1-26-11-18(25)23-15-5-12(7-20-8-15)16-9-21-10-17(24-16)22-14-4-2-3-13(19)6-14/h2-10H,11H2,1H3,(H,22,24)(H,23,25)
Reactome pathway
n/an/a>1.00E+4n/an/an/an/an/an/a
Johnson & Johnson Pharmaceutical
Assay Description
The enzyme was assayed with a biotinylated peptide substrate and test compounds in the presence of 5 uM ATP/[gamma-33P]ATP in a streptavidin coated F...
J Med Chem 48: 4892-909 (2005)
Article DOI: 10.1021/jm058205b
BindingDB Entry DOI: 10.7270/Q2NC5ZD5