BDBM6415 4-[(5-{6-[(3-chlorophenyl)amino]pyrazin-2-yl}pyridin-3-yl)amino]butanoic acid::4-{5-[6-(3-Chloro-phenylamino)-pyrazin-2-yl]-pyridin-3-ylamino}-butyric acid::Pyrazine-Pyridine Biheteroaryl 61
SMILES: OC(=O)CCCNc1cncc(c1)-c1cncc(Nc2cccc(Cl)c2)n1
InChI Key: InChIKey=UVRBDUNZSLJHHW-UHFFFAOYSA-N
Data: 2 IC50
Activity Spreadsheet -- Enzyme Inhibition Constant Data from BindingDB
Found 2 hits for monomerid = 6415
Trg + Lig
Ki
nM
ΔG°
kcal/mole
IC50
nM
Kd
nM
EC50/IC50
nM
koff
s-1
kon
M-1s-1
pHTemp
°C
VEGFR-2 (KDR)
(Rattus norvegicus (rat))
BDBM6415
(4-[(5-{6-[(3-chlorophenyl)amino]pyrazin-2-yl}pyrid...)
Show SMILES OC(=O)CCCNc1cncc(c1)-c1cncc(Nc2cccc(Cl)c2)n1
Show InChI InChI=1S/C19H18ClN5O2/c20-14-3-1-4-15(8-14)24-18-12-22-11-17(25-18)13-7-16(10-21-9-13)23-6-2-5-19(26)27/h1,3-4,7-12,23H,2,5-6H2,(H,24,25)(H,26,27)
n/an/a 568n/an/an/an/an/an/a
Johnson & Johnson Pharmaceutical
Assay Description
The enzyme was assayed with a biotinylated peptide substrate and test compounds in the presence of 5 uM ATP/[gamma-33P]ATP in a streptavidin coated F...
J Med Chem 48: 4892-909 (2005)
Article DOI: 10.1021/jm058205b
BindingDB Entry DOI: 10.7270/Q2NC5ZD5
Cyclin-Dependent Kinase 1 (CDK1)
(Homo sapiens (Human))
BDBM6415
(4-[(5-{6-[(3-chlorophenyl)amino]pyrazin-2-yl}pyrid...)
Show SMILES OC(=O)CCCNc1cncc(c1)-c1cncc(Nc2cccc(Cl)c2)n1
Show InChI InChI=1S/C19H18ClN5O2/c20-14-3-1-4-15(8-14)24-18-12-22-11-17(25-18)13-7-16(10-21-9-13)23-6-2-5-19(26)27/h1,3-4,7-12,23H,2,5-6H2,(H,24,25)(H,26,27)
Reactome pathway
n/an/a 5.22E+3n/an/an/an/an/an/a
Johnson & Johnson Pharmaceutical
Assay Description
The enzyme was assayed with a biotinylated peptide substrate and test compounds in the presence of 5 uM ATP/[gamma-33P]ATP in a streptavidin coated F...
J Med Chem 48: 4892-909 (2005)
Article DOI: 10.1021/jm058205b
BindingDB Entry DOI: 10.7270/Q2NC5ZD5