BDBM6418 N-(3-chlorophenyl)-6-(5-{[2-(dimethylamino)ethyl]amino}pyridin-3-yl)pyrazin-2-amine::N-{5-[6-(3-Chloro-phenylamino)-pyrazin-2-yl]-pyridin-3-yl}-N ,N -dimethyl-ethane-1,2-diamine::Pyrazine-Pyridine Biheteroaryl 41
SMILES: CN(C)CCNc1cncc(c1)-c1cncc(Nc2cccc(Cl)c2)n1
InChI Key: InChIKey=XTEWWTLBXKFYCF-UHFFFAOYSA-N
Data: 6 IC50
Activity Spreadsheet -- Enzyme Inhibition Constant Data from BindingDB
Found 6 hits for monomerid = 6418
Trg + Lig
Ki
nM
ΔG°
kcal/mole
IC50
nM
Kd
nM
EC50/IC50
nM
koff
s-1
kon
M-1s-1
pHTemp
°C
Cyclin-Dependent Kinase 1 (CDK1)
(Homo sapiens (Human))
BDBM6418
(N-(3-chlorophenyl)-6-(5-{[2-(dimethylamino)ethyl]a...)
Show SMILES CN(C)CCNc1cncc(c1)-c1cncc(Nc2cccc(Cl)c2)n1
Show InChI InChI=1S/C19H21ClN6/c1-26(2)7-6-23-17-8-14(10-21-11-17)18-12-22-13-19(25-18)24-16-5-3-4-15(20)9-16/h3-5,8-13,23H,6-7H2,1-2H3,(H,24,25)
Reactome pathway
n/an/a>1.00E+4n/an/an/an/an/an/a
Johnson & Johnson Pharmaceutical
Assay Description
The enzyme was assayed with a biotinylated peptide substrate and test compounds in the presence of 5 uM ATP/[gamma-33P]ATP in a streptavidin coated F...
J Med Chem 48: 4892-909 (2005)
Article DOI: 10.1021/jm058205b
BindingDB Entry DOI: 10.7270/Q2NC5ZD5
VEGFR-2 (KDR)
(Rattus norvegicus (rat))
BDBM6418
(N-(3-chlorophenyl)-6-(5-{[2-(dimethylamino)ethyl]a...)
Show SMILES CN(C)CCNc1cncc(c1)-c1cncc(Nc2cccc(Cl)c2)n1
Show InChI InChI=1S/C19H21ClN6/c1-26(2)7-6-23-17-8-14(10-21-11-17)18-12-22-13-19(25-18)24-16-5-3-4-15(20)9-16/h3-5,8-13,23H,6-7H2,1-2H3,(H,24,25)
n/an/a 105n/an/an/an/an/an/a
Johnson & Johnson Pharmaceutical
Assay Description
The enzyme was assayed with a biotinylated peptide substrate and test compounds in the presence of 5 uM ATP/[gamma-33P]ATP in a streptavidin coated F...
J Med Chem 48: 4892-909 (2005)
Article DOI: 10.1021/jm058205b
BindingDB Entry DOI: 10.7270/Q2NC5ZD5
Epidermal growth factor receptor
(Homo sapiens (Human))
BDBM6418
(N-(3-chlorophenyl)-6-(5-{[2-(dimethylamino)ethyl]a...)
Show SMILES CN(C)CCNc1cncc(c1)-c1cncc(Nc2cccc(Cl)c2)n1
Show InChI InChI=1S/C19H21ClN6/c1-26(2)7-6-23-17-8-14(10-21-11-17)18-12-22-13-19(25-18)24-16-5-3-4-15(20)9-16/h3-5,8-13,23H,6-7H2,1-2H3,(H,24,25)
n/an/a>1.00E+4n/an/an/an/an/an/a
Johnson & Johnson Pharmaceutical
Assay Description
The enzyme was assayed with a biotinylated peptide substrate and test compounds in the presence of 5 uM ATP/[gamma-33P]ATP in a streptavidin coated F...
J Med Chem 48: 4892-909 (2005)
Article DOI: 10.1021/jm058205b
BindingDB Entry DOI: 10.7270/Q2NC5ZD5
Glycogen Synthase Kinase-3, beta
(Oryctolagus cuniculus (rabbit))
BDBM6418
(N-(3-chlorophenyl)-6-(5-{[2-(dimethylamino)ethyl]a...)
Show SMILES CN(C)CCNc1cncc(c1)-c1cncc(Nc2cccc(Cl)c2)n1
Show InChI InChI=1S/C19H21ClN6/c1-26(2)7-6-23-17-8-14(10-21-11-17)18-12-22-13-19(25-18)24-16-5-3-4-15(20)9-16/h3-5,8-13,23H,6-7H2,1-2H3,(H,24,25)
n/an/a>1.00E+4n/an/an/an/an/an/a
Johnson & Johnson Pharmaceutical
Assay Description
The enzyme was assayed with a biotinylated peptide substrate and test compounds in the presence of 5 uM ATP/[gamma-33P]ATP in a streptavidin coated F...
J Med Chem 48: 4892-909 (2005)
Article DOI: 10.1021/jm058205b
BindingDB Entry DOI: 10.7270/Q2NC5ZD5
Fibroblast growth factor receptor 2
(Homo sapiens (Human))
BDBM6418
(N-(3-chlorophenyl)-6-(5-{[2-(dimethylamino)ethyl]a...)
Show SMILES CN(C)CCNc1cncc(c1)-c1cncc(Nc2cccc(Cl)c2)n1
Show InChI InChI=1S/C19H21ClN6/c1-26(2)7-6-23-17-8-14(10-21-11-17)18-12-22-13-19(25-18)24-16-5-3-4-15(20)9-16/h3-5,8-13,23H,6-7H2,1-2H3,(H,24,25)
NCI pathway
Reactome pathway
n/an/a 1.40E+3n/an/an/an/an/an/a
Johnson & Johnson Pharmaceutical
Assay Description
The enzyme was assayed with a biotinylated peptide substrate and test compounds in the presence of 5 uM ATP/[gamma-33P]ATP in a streptavidin coated F...
J Med Chem 48: 4892-909 (2005)
Article DOI: 10.1021/jm058205b
BindingDB Entry DOI: 10.7270/Q2NC5ZD5
Platelet-derived growth factor receptor beta
(Homo sapiens (Human))
BDBM6418
(N-(3-chlorophenyl)-6-(5-{[2-(dimethylamino)ethyl]a...)
Show SMILES CN(C)CCNc1cncc(c1)-c1cncc(Nc2cccc(Cl)c2)n1
Show InChI InChI=1S/C19H21ClN6/c1-26(2)7-6-23-17-8-14(10-21-11-17)18-12-22-13-19(25-18)24-16-5-3-4-15(20)9-16/h3-5,8-13,23H,6-7H2,1-2H3,(H,24,25)
NCI pathway
Reactome pathway
n/an/a>1.00E+4n/an/an/an/an/an/a
Johnson & Johnson Pharmaceutical
Assay Description
The enzyme was assayed with a biotinylated peptide substrate and test compounds in the presence of 5 uM ATP/[gamma-33P]ATP in a streptavidin coated F...
J Med Chem 48: 4892-909 (2005)
Article DOI: 10.1021/jm058205b
BindingDB Entry DOI: 10.7270/Q2NC5ZD5