BDBM6423 3-[(5-{6-[(3-chlorophenyl)amino]pyrazin-2-yl}-6-fluoropyridin-3-yl)amino]propan-1-ol::3-{5-[6-(3-Chloro-phenylamino)-pyrazin-2-yl]-6-fluoropyridin-3-ylamino}-propan-1-ol::Pyrazine-Pyridine Biheteroaryl 70
SMILES: OCCCNc1cnc(F)c(c1)-c1cncc(Nc2cccc(Cl)c2)n1
InChI Key: InChIKey=CWLYLDIPBOBIFQ-UHFFFAOYSA-N
Data: 2 IC50
Activity Spreadsheet -- Enzyme Inhibition Constant Data from BindingDB
Found 2 hits for monomerid = 6423
Trg + Lig
Ki
nM
ΔG°
kcal/mole
IC50
nM
Kd
nM
EC50/IC50
nM
koff
s-1
kon
M-1s-1
pHTemp
°C
Vascular endothelial growth factor receptor 2
(Rattus norvegicus (rat))
BDBM6423
(3-[(5-{6-[(3-chlorophenyl)amino]pyrazin-2-yl}-6-fl...)
Show SMILES OCCCNc1cnc(F)c(c1)-c1cncc(Nc2cccc(Cl)c2)n1
Show InChI InChI=1S/C18H17ClFN5O/c19-12-3-1-4-13(7-12)24-17-11-21-10-16(25-17)15-8-14(9-23-18(15)20)22-5-2-6-26/h1,3-4,7-11,22,26H,2,5-6H2,(H,24,25)
n/an/a 251n/an/an/an/an/an/a
Johnson & Johnson Pharmaceutical
Assay Description
The enzyme was assayed with a biotinylated peptide substrate and test compounds in the presence of 5 uM ATP/[gamma-33P]ATP in a streptavidin coated F...
J Med Chem 48: 4892-909 (2005)
Article DOI: 10.1021/jm058205b
BindingDB Entry DOI: 10.7270/Q2NC5ZD5
Cyclin-dependent kinase/G2/mitotic-specific cyclin- 1
(Homo sapiens (Human))
BDBM6423
(3-[(5-{6-[(3-chlorophenyl)amino]pyrazin-2-yl}-6-fl...)
Show SMILES OCCCNc1cnc(F)c(c1)-c1cncc(Nc2cccc(Cl)c2)n1
Show InChI InChI=1S/C18H17ClFN5O/c19-12-3-1-4-13(7-12)24-17-11-21-10-16(25-17)15-8-14(9-23-18(15)20)22-5-2-6-26/h1,3-4,7-11,22,26H,2,5-6H2,(H,24,25)
Reactome pathway
n/an/a>1.00E+4n/an/an/an/an/an/a
Johnson & Johnson Pharmaceutical
Assay Description
The enzyme was assayed with a biotinylated peptide substrate and test compounds in the presence of 5 uM ATP/[gamma-33P]ATP in a streptavidin coated F...
J Med Chem 48: 4892-909 (2005)
Article DOI: 10.1021/jm058205b
BindingDB Entry DOI: 10.7270/Q2NC5ZD5