BDBM6430 3-[(5-{5-[(3-chlorophenyl)amino]pyrimidin-4-yl}pyridin-3-yl)amino]propan-1-ol::3-[[5-[5-[(3-Chlorophenyl)amino]-4-pyrimidinyl]-3-pyridinyl]amino]-1-propanol::pyrimidine-pyridine deriv.30
SMILES: OCCCNc1cncc(c1)-c1ncncc1Nc1cccc(Cl)c1
InChI Key: InChIKey=PPDYBNPFRNXANS-UHFFFAOYSA-N
Data: 2 IC50
Activity Spreadsheet -- Enzyme Inhibition Constant Data from BindingDB
Found 2 hits for monomerid = 6430
Trg + Lig
Ki
nM
ΔG°
kcal/mole
IC50
nM
Kd
nM
EC50/IC50
nM
koff
s-1
kon
M-1s-1
pHTemp
°C
VEGFR-2 (KDR)
(Rattus norvegicus (rat))
BDBM6430
(3-[(5-{5-[(3-chlorophenyl)amino]pyrimidin-4-yl}pyr...)
Show SMILES OCCCNc1cncc(c1)-c1ncncc1Nc1cccc(Cl)c1
Show InChI InChI=1S/C18H18ClN5O/c19-14-3-1-4-15(8-14)24-17-11-21-12-23-18(17)13-7-16(10-20-9-13)22-5-2-6-25/h1,3-4,7-12,22,24-25H,2,5-6H2
n/an/a>1.00E+4n/an/an/an/an/an/a
Johnson & Johnson Pharmaceutical
Assay Description
The enzyme was assayed with a biotinylated peptide substrate and test compounds in the presence of 5 uM ATP/[gamma-33P]ATP in a streptavidin coated F...
J Med Chem 48: 1886-900 (2005)
Article DOI: 10.1021/jm040099a
BindingDB Entry DOI: 10.7270/Q2HM56NC
Cyclin-Dependent Kinase 1 (CDK1)
(Homo sapiens (Human))
BDBM6430
(3-[(5-{5-[(3-chlorophenyl)amino]pyrimidin-4-yl}pyr...)
Show SMILES OCCCNc1cncc(c1)-c1ncncc1Nc1cccc(Cl)c1
Show InChI InChI=1S/C18H18ClN5O/c19-14-3-1-4-15(8-14)24-17-11-21-12-23-18(17)13-7-16(10-20-9-13)22-5-2-6-25/h1,3-4,7-12,22,24-25H,2,5-6H2
Reactome pathway
n/an/a>1.00E+4n/an/an/an/a8.030
Johnson & Johnson Pharmaceutical
Assay Description
The enzyme was assayed with a biotinylated peptide substrate and test compounds in the presence of 5 uM ATP/[gamma-33P]ATP in a streptavidin coated F...
J Med Chem 48: 1886-900 (2005)
Article DOI: 10.1021/jm040099a
BindingDB Entry DOI: 10.7270/Q2HM56NC