BDBM64327 (5Z)-3-(2-aminoethyl)-5-(1,3-benzodioxol-5-ylmethylidene)-1,3-thiazolidine-2,4-dione;hydrochloride::(5Z)-3-(2-aminoethyl)-5-(1,3-benzodioxol-5-ylmethylidene)thiazolidine-2,4-dione;hydrochloride::(5Z)-3-(2-aminoethyl)-5-piperonylidene-thiazolidine-2,4-quinone;hydrochloride::(5Z)-3-(2-azanylethyl)-5-(1,3-benzodioxol-5-ylmethylidene)-1,3-thiazolidine-2,4-dione;hydrochloride::MLS001233723::SMR000587992::cid_18204049
SMILES: NCCN1C(=O)S\C(=C/c2ccc3OCOc3c2)C1=O
InChI Key: InChIKey=ZAWGHGDNVXQOKU-WDZFZDKYSA-N
Data: 1 IC50  1 EC50
Activity Spreadsheet -- Enzyme Inhibition Constant Data from BindingDB
Found 2 hits for monomerid = 64327
Trg + Lig
Ki
nM
ΔG°
kcal/mole
IC50
nM
Kd
nM
EC50/IC50
nM
koff
s-1
kon
M-1s-1
pHTemp
°C
endothelial PAS domain-containing protein 1
(Homo sapiens (Human))
BDBM64327
((5Z)-3-(2-aminoethyl)-5-(1,3-benzodioxol-5-ylmethy...)
Show SMILES NCCN1C(=O)S\C(=C/c2ccc3OCOc3c2)C1=O
Show InChI InChI=1S/C13H12N2O4S/c14-3-4-15-12(16)11(20-13(15)17)6-8-1-2-9-10(5-8)19-7-18-9/h1-2,5-6H,3-4,7,14H2/b11-6-
Reactome pathway
PCBioAssay
n/an/a 1.12E+3n/an/an/an/an/an/a
Burnham Center for Chemical Genomics
Curated by PubChem BioAssay
PubChem Bioassay (2012)
BindingDB Entry DOI: 10.7270/Q2WS8RVZ
Hsf1 protein
(Mus musculus)
BDBM64327
((5Z)-3-(2-aminoethyl)-5-(1,3-benzodioxol-5-ylmethy...)
Show SMILES NCCN1C(=O)S\C(=C/c2ccc3OCOc3c2)C1=O
Show InChI InChI=1S/C13H12N2O4S/c14-3-4-15-12(16)11(20-13(15)17)6-8-1-2-9-10(5-8)19-7-18-9/h1-2,5-6H,3-4,7,14H2/b11-6-
PCBioAssay
n/an/an/an/a 1.48E+3n/an/an/an/a
Broad Institute
Curated by PubChem BioAssay
Assay Description
Keywords: Heat Shock Factor-1 (HSF-1), Stress Response, MG132, NIH3T3, Luminescence Assay Overview: Modified NIH3T3, transformed to express firefly...
PubChem Bioassay (2010)
BindingDB Entry DOI: 10.7270/Q2MW2FKX