BDBM64538 MLS000030000::N-(5-Ethyl-[1,3,4]thiadiazol-2-yl)-2-[4-(4-phenyl-thiazol-2-yl)-piperazin-1-yl]-acetamide::N-(5-ethyl-1,3,4-thiadiazol-2-yl)-2-[4-(4-phenyl-1,3-thiazol-2-yl)piperazin-1-yl]acetamide::N-(5-ethyl-1,3,4-thiadiazol-2-yl)-2-[4-(4-phenyl-1,3-thiazol-2-yl)piperazin-1-yl]ethanamide::N-(5-ethyl-1,3,4-thiadiazol-2-yl)-2-[4-(4-phenyl-2-thiazolyl)-1-piperazinyl]acetamide::N-(5-ethyl-1,3,4-thiadiazol-2-yl)-2-[4-(4-phenylthiazol-2-yl)piperazino]acetamide::SMR000007114::cid_653565
SMILES: CCc1nnc(NC(=O)CN2CCN(CC2)c2nc(cs2)-c2ccccc2)s1
InChI Key: InChIKey=YPCCHYCMMPOISV-UHFFFAOYSA-N
Data: 4 EC50
Activity Spreadsheet -- Enzyme Inhibition Constant Data from BindingDB
Found 4 hits for monomerid = 64538
Trg + Lig
Ki
nM
ΔG°
kcal/mole
IC50
nM
Kd
nM
EC50/IC50
nM
koff
s-1
kon
M-1s-1
pHTemp
°C
heat shock protein 90
(Candida albicans)
BDBM64538
(MLS000030000 | N-(5-Ethyl-[1,3,4]thiadiazol-2-yl)-...)
Show SMILES CCc1nnc(NC(=O)CN2CCN(CC2)c2nc(cs2)-c2ccccc2)s1
Show InChI InChI=1S/C19H22N6OS2/c1-2-17-22-23-18(28-17)21-16(26)12-24-8-10-25(11-9-24)19-20-15(13-27-19)14-6-4-3-5-7-14/h3-7,13H,2,8-12H2,1H3,(H,21,23,26)
PCBioAssay
n/an/an/an/a>1.50E+5n/an/an/an/a
Broad Institute
Curated by PubChem BioAssay
Assay Description
Keywords: Candida albicans, drug resistance, Fluconazole, Hsp90, Calcineurin, stress response Primary Collaborators: Susan Lindquist, Whitehead Insti...
PubChem Bioassay (2010)
BindingDB Entry DOI: 10.7270/Q2H41PWZ
heat shock protein 90
(Candida albicans)
BDBM64538
(MLS000030000 | N-(5-Ethyl-[1,3,4]thiadiazol-2-yl)-...)
Show SMILES CCc1nnc(NC(=O)CN2CCN(CC2)c2nc(cs2)-c2ccccc2)s1
Show InChI InChI=1S/C19H22N6OS2/c1-2-17-22-23-18(28-17)21-16(26)12-24-8-10-25(11-9-24)19-20-15(13-27-19)14-6-4-3-5-7-14/h3-7,13H,2,8-12H2,1H3,(H,21,23,26)
PCBioAssay
n/an/an/an/a 371n/an/an/an/a
Broad Institute
Curated by PubChem BioAssay
Assay Description
Broad Institute: Reversing Antifungal Drug Resistance Project ID: 2037 Keywords: Candida albicans, drug resistance, Fluconazole, Hsp90, Calcineurin, ...
PubChem Bioassay (2010)
BindingDB Entry DOI: 10.7270/Q26M358G
heat shock protein 90
(Candida albicans)
BDBM64538
(MLS000030000 | N-(5-Ethyl-[1,3,4]thiadiazol-2-yl)-...)
Show SMILES CCc1nnc(NC(=O)CN2CCN(CC2)c2nc(cs2)-c2ccccc2)s1
Show InChI InChI=1S/C19H22N6OS2/c1-2-17-22-23-18(28-17)21-16(26)12-24-8-10-25(11-9-24)19-20-15(13-27-19)14-6-4-3-5-7-14/h3-7,13H,2,8-12H2,1H3,(H,21,23,26)
PCBioAssay
n/an/an/an/a>1.50E+5n/an/an/an/a
Broad Institute
Curated by PubChem BioAssay
Assay Description
Keywords: Candida albicans, drug resistance, Fluconazole, Hsp90, stress response Assay Overview: Method for determining if compound acts as Hsp90 inh...
PubChem Bioassay (2010)
BindingDB Entry DOI: 10.7270/Q2V986HQ
calcineurin A1, putative
(Candida dubliniensis CD36)
BDBM64538
(MLS000030000 | N-(5-Ethyl-[1,3,4]thiadiazol-2-yl)-...)
Show SMILES CCc1nnc(NC(=O)CN2CCN(CC2)c2nc(cs2)-c2ccccc2)s1
Show InChI InChI=1S/C19H22N6OS2/c1-2-17-22-23-18(28-17)21-16(26)12-24-8-10-25(11-9-24)19-20-15(13-27-19)14-6-4-3-5-7-14/h3-7,13H,2,8-12H2,1H3,(H,21,23,26)
PCBioAssay
n/an/an/an/a 1.80E+5n/an/an/an/a
Broad Institute
Curated by PubChem BioAssay
Assay Description
Keywords: Candida albicans, drug resistance, Fluconazole, calcineurin, stress response Assay Overview: Method for determining if compound acts as Ca...
PubChem Bioassay (2010)
BindingDB Entry DOI: 10.7270/Q2CC0Z46