null
SMILES: Oc1c(cc(Cl)c2cccnc12)[N+]([O-])=O
InChI Key: InChIKey=YMZCBKSIFLQQEM-UHFFFAOYSA-N
Activity Spreadsheet -- Enzyme Inhibition Constant Data from BindingDB
Found 2 hits for monomerid = 64648
Trg + Lig
Ki
nM
ΔG°
kcal/mole
IC50
nM
Kd
nM
EC50/IC50
nM
koff
s-1
kon
M-1s-1
pHTemp
°C
Vacuolar aminopeptidase 1
(Saccharomyces cerevisiae)
BDBM64648
(5-chloranyl-7-nitro-quinolin-8-ol | 5-chloro-7-nit...)
Show SMILES Oc1c(cc(Cl)c2cccnc12)[N+]([O-])=O
Show InChI InChI=1S/C9H5ClN2O3/c10-6-4-7(12(14)15)9(13)8-5(6)2-1-3-11-8/h1-4,13H
PCBioAssay
n/an/an/an/a 859n/an/an/an/a
NMMLSC
Curated by PubChem BioAssay
Assay Description
University of New Mexico Assay Overview: Assay Support: 1R03 MH086450-01 Project Title: Chemical Screen of TOR pathway GFP fusion proteins in S. ...
PubChem Bioassay (2010)
BindingDB Entry DOI: 10.7270/Q21R6P02
60S ribosomal protein L19-A
(Saccharomyces cerevisiae)
BDBM64648
(5-chloranyl-7-nitro-quinolin-8-ol | 5-chloro-7-nit...)
Show SMILES Oc1c(cc(Cl)c2cccnc12)[N+]([O-])=O
Show InChI InChI=1S/C9H5ClN2O3/c10-6-4-7(12(14)15)9(13)8-5(6)2-1-3-11-8/h1-4,13H
Reactome pathway
PCBioAssay
n/an/an/an/a 1.30E+4n/an/an/an/a
NMMLSC
Curated by PubChem BioAssay
Assay Description
University of New Mexico Assay Overview: Assay Support: 1R03 MH086450-01 Project Title: Chemical Screen of TOR pathway GFP fusion proteins in S. ...
PubChem Bioassay (2010)
BindingDB Entry DOI: 10.7270/Q2JQ0ZGP