BDBM64785 3-[(2,6-Di-pyrrolidin-1-yl-pyrimidin-4-yl)-hydrazonomethyl]-phenol::3-[[(2,6-dipyrrolidin-1-ylpyrimidin-4-yl)hydrazinylidene]methyl]phenol::3-[[(2,6-dipyrrolidinopyrimidin-4-yl)hydrazono]methyl]phenol::3-[[[2,6-bis(1-pyrrolidinyl)-4-pyrimidinyl]hydrazinylidene]methyl]phenol::MLS000553694::SMR000171513::cid_2851959
SMILES: Oc1cccc(CN=Nc2cc(nc(n2)N2CCCC2)N2CCCC2)c1
InChI Key: InChIKey=HYWJTLYOGDKCED-UHFFFAOYSA-N
Data: 8 IC50  1 EC50
Activity Spreadsheet -- Enzyme Inhibition Constant Data from BindingDB
Found 9 hits for monomerid = 64785
Trg + Lig
Ki
nM
ΔG°
kcal/mole
IC50
nM
Kd
nM
EC50/IC50
nM
koff
s-1
kon
M-1s-1
pHTemp
°C
protein phosphatase 1, catalytic subunit, alpha isoform 3
(Homo sapiens (Human))
BDBM64785
(3-[(2,6-Di-pyrrolidin-1-yl-pyrimidin-4-yl)-hydrazo...)
Show SMILES Oc1cccc(CN=Nc2cc(nc(n2)N2CCCC2)N2CCCC2)c1 |w:8.8|
Show InChI InChI=1S/C19H24N6O/c26-16-7-5-6-15(12-16)14-20-23-17-13-18(24-8-1-2-9-24)22-19(21-17)25-10-3-4-11-25/h5-7,12-13,26H,1-4,8-11,14H2
NCI pathway
Reactome pathway
PCBioAssay
n/an/a 2.16E+4n/an/an/an/an/an/a
The Scripps Research Institute Molecular Screening Center
Curated by PubChem BioAssay
Assay Description
Source (MLPCN Center Name): The Scripps Research Institute Molecular Screening Center (SRIMSC) Center Affiliation: The Scripps Research Institute (TS...
PubChem Bioassay (2010)
BindingDB Entry DOI: 10.7270/Q27M06CD
PPP5C protein
(Homo sapiens (Human))
BDBM64785
(3-[(2,6-Di-pyrrolidin-1-yl-pyrimidin-4-yl)-hydrazo...)
Show SMILES Oc1cccc(CN=Nc2cc(nc(n2)N2CCCC2)N2CCCC2)c1 |w:8.8|
Show InChI InChI=1S/C19H24N6O/c26-16-7-5-6-15(12-16)14-20-23-17-13-18(24-8-1-2-9-24)22-19(21-17)25-10-3-4-11-25/h5-7,12-13,26H,1-4,8-11,14H2
PCBioAssay
n/an/a 5.83E+3n/an/an/an/an/an/a
The Scripps Research Institute Molecular Screening Center
Curated by PubChem BioAssay
Assay Description
Source (MLPCN Center Name): The Scripps Research Institute Molecular Screening Center (SRIMSC) Center Affiliation: The Scripps Research Institute (TS...
PubChem Bioassay (2010)
BindingDB Entry DOI: 10.7270/Q23T9FN4
karyopherin alpha 2 (RAG cohort 1, importin alpha 1), isoform CRA_b
(Homo sapiens (Human))
BDBM64785
(3-[(2,6-Di-pyrrolidin-1-yl-pyrimidin-4-yl)-hydrazo...)
Show SMILES Oc1cccc(CN=Nc2cc(nc(n2)N2CCCC2)N2CCCC2)c1 |w:8.8|
Show InChI InChI=1S/C19H24N6O/c26-16-7-5-6-15(12-16)14-20-23-17-13-18(24-8-1-2-9-24)22-19(21-17)25-10-3-4-11-25/h5-7,12-13,26H,1-4,8-11,14H2
Reactome pathway
PCBioAssay
n/an/an/an/a>5.00E+5n/an/an/an/a
Broad Institute
Curated by PubChem BioAssay
Assay Description
Keywords: Counterscreen, FRET assay, HTS, YIC probe, Dose response, Assay Overview: This is a fluorescence resonance energy transfer (FRET)-based b...
PubChem Bioassay (2010)
BindingDB Entry DOI: 10.7270/Q280513R
SUMO/sentrin specific peptidase family member 8
(Homo sapiens (Human))
BDBM64785
(3-[(2,6-Di-pyrrolidin-1-yl-pyrimidin-4-yl)-hydrazo...)
Show SMILES Oc1cccc(CN=Nc2cc(nc(n2)N2CCCC2)N2CCCC2)c1 |w:8.8|
Show InChI InChI=1S/C19H24N6O/c26-16-7-5-6-15(12-16)14-20-23-17-13-18(24-8-1-2-9-24)22-19(21-17)25-10-3-4-11-25/h5-7,12-13,26H,1-4,8-11,14H2
PCBioAssay
n/an/a 1.72E+4n/an/an/an/an/an/a
Burnham Center for Chemical Genomics
Curated by PubChem BioAssay
Assay Description
Data Source: Sanford-Burnham Center for Chemical Genomics (SBCCG) Source Affiliation: Sanford-Burnham Medical Research Institute (SBMRI, San Diego, C...
PubChem Bioassay (2010)
BindingDB Entry DOI: 10.7270/Q2MS3R7H
Caspase-9
(Homo sapiens (Human))
BDBM64785
(3-[(2,6-Di-pyrrolidin-1-yl-pyrimidin-4-yl)-hydrazo...)
Show SMILES Oc1cccc(CN=Nc2cc(nc(n2)N2CCCC2)N2CCCC2)c1 |w:8.8|
Show InChI InChI=1S/C19H24N6O/c26-16-7-5-6-15(12-16)14-20-23-17-13-18(24-8-1-2-9-24)22-19(21-17)25-10-3-4-11-25/h5-7,12-13,26H,1-4,8-11,14H2
NCI pathway
Reactome pathway
PCBioAssay
n/an/a 1.25E+4n/an/an/an/an/an/a
Burnham Center for Chemical Genomics
Curated by PubChem BioAssay
Assay Description
Data Source: Sanford-Burnham Center for Chemical Genomics (SBCCG) Source Affiliation: Sanford-Burnham Medical Research Institute (SBIMR, San Diego, C...
PubChem Bioassay (2011)
BindingDB Entry DOI: 10.7270/Q25M647F
Caspase-3
(Homo sapiens (Human))
BDBM64785
(3-[(2,6-Di-pyrrolidin-1-yl-pyrimidin-4-yl)-hydrazo...)
Show SMILES Oc1cccc(CN=Nc2cc(nc(n2)N2CCCC2)N2CCCC2)c1 |w:8.8|
Show InChI InChI=1S/C19H24N6O/c26-16-7-5-6-15(12-16)14-20-23-17-13-18(24-8-1-2-9-24)22-19(21-17)25-10-3-4-11-25/h5-7,12-13,26H,1-4,8-11,14H2
NCI pathway
Reactome pathway
PCBioAssay
n/an/a>1.00E+5n/an/an/an/an/an/a
Burnham Center for Chemical Genomics
Curated by PubChem BioAssay
Assay Description
Data Source: Sanford-Burnham Center for Chemical Genomics (SBCCG) Source Affiliation: Sanford-Burnham Medical Research Institute (SBMRI, San Diego, C...
PubChem Bioassay (2010)
BindingDB Entry DOI: 10.7270/Q2RJ4GZT
Apoptotic peptidase activating factor 1
(Homo sapiens (Human))
BDBM64785
(3-[(2,6-Di-pyrrolidin-1-yl-pyrimidin-4-yl)-hydrazo...)
Show SMILES Oc1cccc(CN=Nc2cc(nc(n2)N2CCCC2)N2CCCC2)c1 |w:8.8|
Show InChI InChI=1S/C19H24N6O/c26-16-7-5-6-15(12-16)14-20-23-17-13-18(24-8-1-2-9-24)22-19(21-17)25-10-3-4-11-25/h5-7,12-13,26H,1-4,8-11,14H2
Reactome pathway
PCBioAssay
n/an/a 1.84E+3n/an/an/an/an/an/a
Burnham Center for Chemical Genomics
Curated by PubChem BioAssay
Assay Description
Data Source: Sanford-Burnham Center for Chemical Genomics (SBCCG) Source Affiliation: Sanford-Burnham Medical Research Institute (SBIMR, San Diego, C...
PubChem Bioassay (2011)
BindingDB Entry DOI: 10.7270/Q2JS9NZB
Apoptotic peptidase activating factor 1
(Homo sapiens (Human))
BDBM64785
(3-[(2,6-Di-pyrrolidin-1-yl-pyrimidin-4-yl)-hydrazo...)
Show SMILES Oc1cccc(CN=Nc2cc(nc(n2)N2CCCC2)N2CCCC2)c1 |w:8.8|
Show InChI InChI=1S/C19H24N6O/c26-16-7-5-6-15(12-16)14-20-23-17-13-18(24-8-1-2-9-24)22-19(21-17)25-10-3-4-11-25/h5-7,12-13,26H,1-4,8-11,14H2
Reactome pathway
PCBioAssay
n/an/a>1.00E+5n/an/an/an/an/an/a
Burnham Center for Chemical Genomics
Curated by PubChem BioAssay
Assay Description
Data Source: Sanford-Burnham Center for Chemical Genomics (SBCCG) Source Affiliation: Sanford-Burnham Medical Research Institute (SBIMR, San Diego, C...
PubChem Bioassay (2011)
BindingDB Entry DOI: 10.7270/Q2F18X8S
SUMO-1-specific protease
(Homo sapiens (Human))
BDBM64785
(3-[(2,6-Di-pyrrolidin-1-yl-pyrimidin-4-yl)-hydrazo...)
Show SMILES Oc1cccc(CN=Nc2cc(nc(n2)N2CCCC2)N2CCCC2)c1 |w:8.8|
Show InChI InChI=1S/C19H24N6O/c26-16-7-5-6-15(12-16)14-20-23-17-13-18(24-8-1-2-9-24)22-19(21-17)25-10-3-4-11-25/h5-7,12-13,26H,1-4,8-11,14H2
PCBioAssay
n/an/a 6.69E+3n/an/an/an/an/an/a
Burnham Center for Chemical Genomics
Curated by PubChem BioAssay
Assay Description
Data Source: Sanford-Burnham Center for Chemical Genomics (SBCCG) Source Affiliation: Sanford-Burnham Medical Research Institute (SBMRI, San Diego, C...
PubChem Bioassay (2010)
BindingDB Entry DOI: 10.7270/Q27H1H10