BDBM6479 4-Anilino-7,8-dialkoxybenzo[g]quinoline-3-carbonitrile 17j::7-methoxy-8-[2-(morpholin-4-yl)ethoxy]-4-[(3,4,5-trimethoxyphenyl)amino]benzo[g]quinoline-3-carbonitrile
SMILES: COc1cc2cc3c(Nc4cc(OC)c(OC)c(OC)c4)c(cnc3cc2cc1OCCN1CCOCC1)C#N
InChI Key: InChIKey=IDFGFXNUUGBOLS-UHFFFAOYSA-N
Data: 1 IC50
Activity Spreadsheet -- Enzyme Inhibition Constant Data from BindingDB
Found 1 hit for monomerid = 6479
Trg + Lig
Ki
nM
ΔG°
kcal/mole
IC50
nM
Kd
nM
EC50/IC50
nM
koff
s-1
kon
M-1s-1
pHTemp
°C
Proto-oncogene tyrosine-protein kinase Src
(Homo sapiens (Human))
BDBM6479
(4-Anilino-7,8-dialkoxybenzo[g]quinoline-3-carbonit...)
Show SMILES COc1cc2cc3c(Nc4cc(OC)c(OC)c(OC)c4)c(cnc3cc2cc1OCCN1CCOCC1)C#N
Show InChI InChI=1S/C30H32N4O6/c1-35-25-13-19-11-23-24(12-20(19)14-26(25)40-10-7-34-5-8-39-9-6-34)32-18-21(17-31)29(23)33-22-15-27(36-2)30(38-4)28(16-22)37-3/h11-16,18H,5-10H2,1-4H3,(H,32,33)
n/an/a 0.220n/an/an/an/a7.530
Wyeth Research
Assay Description
Src kinase activity was measured in an ELISA format. IC50 is the inhibitor concentration which inhibits 50% of kinase activity that catalyzes the tra...
Bioorg Med Chem Lett 12: 2989-92 (2002)
Article DOI: 10.1016/s0960-894x(02)00577-2
BindingDB Entry DOI: 10.7270/Q24B2ZHC