null
SMILES: CCn1c(NC(=O)c2cccs2)nc2ccccc12
InChI Key: InChIKey=UVQPAHGWEJTPKF-UHFFFAOYSA-N
Activity Spreadsheet -- Enzyme Inhibition Constant Data from BindingDB
Found 1 hit for monomerid = 64888
Trg + Lig
Ki
nM
ΔG°
kcal/mole
IC50
nM
Kd
nM
EC50/IC50
nM
koff
s-1
kon
M-1s-1
pHTemp
°C
ATP-dependent molecular chaperone HSP82
(Candida albicans)
BDBM64888
(MLS000071812 | N-(1-ethyl-2-benzimidazolyl)-2-thio...)
Show SMILES CCn1c(NC(=O)c2cccs2)nc2ccccc12
Show InChI InChI=1S/C14H13N3OS/c1-2-17-11-7-4-3-6-10(11)15-14(17)16-13(18)12-8-5-9-19-12/h3-9H,2H2,1H3,(H,15,16,18)
PCBioAssay
n/an/an/an/a 1.28E+3n/an/an/an/a
Broad Institute
Curated by PubChem BioAssay
Assay Description
Broad Institute: Reversing Antifungal Drug Resistance Project ID: 2037 Keywords: Candida albicans, drug resistance, Fluconazole, Hsp90, Calcineurin, ...
PubChem Bioassay (2010)
BindingDB Entry DOI: 10.7270/Q26M358G