null
SMILES: Clc1cccc(NC(=O)Nc2nccs2)c1
InChI Key: InChIKey=YJCQYEFUYHEVTJ-UHFFFAOYSA-N
Activity Spreadsheet -- Enzyme Inhibition Constant Data from BindingDB
Found 1 hit for monomerid = 64892
Trg + Lig
Ki
nM
ΔG°
kcal/mole
IC50
nM
Kd
nM
EC50/IC50
nM
koff
s-1
kon
M-1s-1
pHTemp
°C
ATP-dependent molecular chaperone HSP82
(Candida albicans)
BDBM64892
(1-(3-Chloro-phenyl)-3-thiazol-2-yl-urea | 1-(3-chl...)
Show SMILES Clc1cccc(NC(=O)Nc2nccs2)c1
Show InChI InChI=1S/C10H8ClN3OS/c11-7-2-1-3-8(6-7)13-9(15)14-10-12-4-5-16-10/h1-6H,(H2,12,13,14,15)
PCBioAssay
n/an/an/an/a 146n/an/an/an/a
Broad Institute
Curated by PubChem BioAssay
Assay Description
Broad Institute: Reversing Antifungal Drug Resistance Project ID: 2037 Keywords: Candida albicans, drug resistance, Fluconazole, Hsp90, Calcineurin, ...
PubChem Bioassay (2010)
BindingDB Entry DOI: 10.7270/Q26M358G