null
SMILES: COC(=O)c1c[nH]n2c1nc(C)c(Cc1ccc(F)cc1Cl)c2=O
InChI Key: InChIKey=MHMYSGCTYIOPLI-UHFFFAOYSA-N
Activity Spreadsheet -- Enzyme Inhibition Constant Data from BindingDB
Found 1 hit for monomerid = 64930
Trg + Lig
Ki
nM
ΔG°
kcal/mole
IC50
nM
Kd
nM
EC50/IC50
nM
koff
s-1
kon
M-1s-1
pHTemp
°C
ATP-dependent molecular chaperone HSP82
(Candida albicans)
BDBM64930
(6-(2-chloro-4-fluoro-benzyl)-7-keto-5-methyl-1H-py...)
Show SMILES COC(=O)c1c[nH]n2c1nc(C)c(Cc1ccc(F)cc1Cl)c2=O
Show InChI InChI=1S/C16H13ClFN3O3/c1-8-11(5-9-3-4-10(18)6-13(9)17)15(22)21-14(20-8)12(7-19-21)16(23)24-2/h3-4,6-7,19H,5H2,1-2H3
PCBioAssay
n/an/an/an/a 755n/an/an/an/a
Broad Institute
Curated by PubChem BioAssay
Assay Description
Broad Institute: Reversing Antifungal Drug Resistance Project ID: 2037 Keywords: Candida albicans, drug resistance, Fluconazole, Hsp90, Calcineurin, ...
PubChem Bioassay (2010)
BindingDB Entry DOI: 10.7270/Q26M358G