BDBM65041 US10166249, Example 412::US10709719, Example 412::US9522888, 412
SMILES: CCCCCOC[C@@H]1COc2cc(ccc2O1)[C@H]1CC[C@](N)(COP(O)(O)=O)C1
InChI Key: InChIKey=XFNWLBLKUWRFPE-SQGPQFPESA-N
Data: 5 IC50  6 EC50
Activity Spreadsheet -- Enzyme Inhibition Constant Data from BindingDB
Found 11 hits for monomerid = 65041
Trg + Lig
Ki
nM
ΔG°
kcal/mole
IC50
nM
Kd
nM
EC50/IC50
nM
koff
s-1
kon
M-1s-1
pHTemp
°C
Sphingosine 1-phosphate receptor 1
(Homo sapiens (Human))
BDBM65041
(US10166249, Example 412 | US10709719, Example 412 ...)
Show SMILES CCCCCOC[C@@H]1COc2cc(ccc2O1)[C@H]1CC[C@](N)(COP(O)(O)=O)C1 |r|
Show InChI InChI=1S/C20H32NO7P/c1-2-3-4-9-25-12-17-13-26-19-10-15(5-6-18(19)28-17)16-7-8-20(21,11-16)14-27-29(22,23)24/h5-6,10,16-17H,2-4,7-9,11-14,21H2,1H3,(H2,22,23,24)/t16-,17+,20+/m0/s1
Reactome pathway
US Patent
n/an/a<10n/an/an/an/a7.525
Bristol-Myers Squibb Company
US Patent
Assay Description
Membranes were prepared from CHO cells expressing human S1P1. Cells pellets (1x10^9 cells/pellet) were suspended in buffer containing 20 mM HEPES (4-...
US Patent US9522888 (2016)
BindingDB Entry DOI: 10.7270/Q20K27HV
Sphingosine 1-phosphate receptor 1
(Homo sapiens (Human))
BDBM65041
(US10166249, Example 412 | US10709719, Example 412 ...)
Show SMILES CCCCCOC[C@@H]1COc2cc(ccc2O1)[C@H]1CC[C@](N)(COP(O)(O)=O)C1 |r|
Show InChI InChI=1S/C20H32NO7P/c1-2-3-4-9-25-12-17-13-26-19-10-15(5-6-18(19)28-17)16-7-8-20(21,11-16)14-27-29(22,23)24/h5-6,10,16-17H,2-4,7-9,11-14,21H2,1H3,(H2,22,23,24)/t16-,17+,20+/m0/s1
Reactome pathway
US Patent
n/an/an/an/a<10n/an/an/a60
Bristol-Myers Squibb Company
US Patent
Assay Description
Compounds were loaded in a 384 Falcon v-bottom plate (0.5 ul/well in a 11 point, 3-fold dilution). Membranes prepared from S1P1/CHO cells or EDG3-Gal...
US Patent US9522888 (2016)
BindingDB Entry DOI: 10.7270/Q20K27HV
Sphingosine 1-phosphate receptor 1
(Homo sapiens (Human))
BDBM65041
(US10166249, Example 412 | US10709719, Example 412 ...)
Show SMILES CCCCCOC[C@@H]1COc2cc(ccc2O1)[C@H]1CC[C@](N)(COP(O)(O)=O)C1 |r|
Show InChI InChI=1S/C20H32NO7P/c1-2-3-4-9-25-12-17-13-26-19-10-15(5-6-18(19)28-17)16-7-8-20(21,11-16)14-27-29(22,23)24/h5-6,10,16-17H,2-4,7-9,11-14,21H2,1H3,(H2,22,23,24)/t16-,17+,20+/m0/s1
Reactome pathway
US Patent
n/an/an/an/a<10n/an/an/a37
Bristol-Myers Squibb Company
US Patent
Assay Description
hS1P1/CHO cells were plated into BD Amine 384-well plates the day before the assay. On the day of the assay, growth medium was removed and replaced w...
US Patent US9522888 (2016)
BindingDB Entry DOI: 10.7270/Q20K27HV
Sphingosine 1-phosphate receptor 3
(Homo sapiens (Human))
BDBM65041
(US10166249, Example 412 | US10709719, Example 412 ...)
Show SMILES CCCCCOC[C@@H]1COc2cc(ccc2O1)[C@H]1CC[C@](N)(COP(O)(O)=O)C1 |r|
Show InChI InChI=1S/C20H32NO7P/c1-2-3-4-9-25-12-17-13-26-19-10-15(5-6-18(19)28-17)16-7-8-20(21,11-16)14-27-29(22,23)24/h5-6,10,16-17H,2-4,7-9,11-14,21H2,1H3,(H2,22,23,24)/t16-,17+,20+/m0/s1
NCI pathway
Reactome pathway
US Patent
n/an/an/an/a>625n/an/an/a60
Bristol-Myers Squibb Company
US Patent
Assay Description
Compounds were loaded in a 384 Falcon v-bottom plate (0.5 ul/well in a 11 point, 3-fold dilution). Membranes prepared from S1P1/CHO cells or EDG3-Gal...
US Patent US9522888 (2016)
BindingDB Entry DOI: 10.7270/Q20K27HV
Sphingosine-1-phosphate lyase 1
(Homo sapiens (Human))
BDBM65041
(US10166249, Example 412 | US10709719, Example 412 ...)
Show SMILES CCCCCOC[C@@H]1COc2cc(ccc2O1)[C@H]1CC[C@](N)(COP(O)(O)=O)C1 |r|
Show InChI InChI=1S/C20H32NO7P/c1-2-3-4-9-25-12-17-13-26-19-10-15(5-6-18(19)28-17)16-7-8-20(21,11-16)14-27-29(22,23)24/h5-6,10,16-17H,2-4,7-9,11-14,21H2,1H3,(H2,22,23,24)/t16-,17+,20+/m0/s1
US Patent
n/an/a<10n/an/an/an/an/an/a
Bristol-Myers Squibb Company
US Patent
Assay Description
Membranes were prepared from CHO cells expressing human S1P1. Cells pellets (1×109 cells/pellet) were suspended in buffer containing 20 mM HEPES (4-(...
US Patent US10166249 (2019)
BindingDB Entry DOI: 10.7270/Q2S75JCM
Sphingosine 1-phosphate receptor 3
(Homo sapiens (Human))
BDBM65041
(US10166249, Example 412 | US10709719, Example 412 ...)
Show SMILES CCCCCOC[C@@H]1COc2cc(ccc2O1)[C@H]1CC[C@](N)(COP(O)(O)=O)C1 |r|
Show InChI InChI=1S/C20H32NO7P/c1-2-3-4-9-25-12-17-13-26-19-10-15(5-6-18(19)28-17)16-7-8-20(21,11-16)14-27-29(22,23)24/h5-6,10,16-17H,2-4,7-9,11-14,21H2,1H3,(H2,22,23,24)/t16-,17+,20+/m0/s1
NCI pathway
Reactome pathway
US Patent
n/an/a>1.00E+4n/an/an/an/an/an/a
Bristol-Myers Squibb Company
US Patent
Assay Description
GTPγS:Compounds were loaded in a 384 Falcon v-bottom plate (0.5 μl/well in a 11 point, 3-fold dilution). Membranes prepared from S1P1/CHO c...
US Patent US10709719 (2020)
Sphingosine-1-phosphate lyase 1
(Homo sapiens (Human))
BDBM65041
(US10166249, Example 412 | US10709719, Example 412 ...)
Show SMILES CCCCCOC[C@@H]1COc2cc(ccc2O1)[C@H]1CC[C@](N)(COP(O)(O)=O)C1 |r|
Show InChI InChI=1S/C20H32NO7P/c1-2-3-4-9-25-12-17-13-26-19-10-15(5-6-18(19)28-17)16-7-8-20(21,11-16)14-27-29(22,23)24/h5-6,10,16-17H,2-4,7-9,11-14,21H2,1H3,(H2,22,23,24)/t16-,17+,20+/m0/s1
US Patent
n/an/an/an/a<10n/an/an/an/a
Bristol-Myers Squibb Company
US Patent
Assay Description
hS1P1/CHO cells were plated into BD Amine 384-well plates the day before the assay. On the day of the assay, growth medium was removed and replaced w...
US Patent US10166249 (2019)
BindingDB Entry DOI: 10.7270/Q2S75JCM
Sphingosine 1-phosphate receptor 3
(Homo sapiens (Human))
BDBM65041
(US10166249, Example 412 | US10709719, Example 412 ...)
Show SMILES CCCCCOC[C@@H]1COc2cc(ccc2O1)[C@H]1CC[C@](N)(COP(O)(O)=O)C1 |r|
Show InChI InChI=1S/C20H32NO7P/c1-2-3-4-9-25-12-17-13-26-19-10-15(5-6-18(19)28-17)16-7-8-20(21,11-16)14-27-29(22,23)24/h5-6,10,16-17H,2-4,7-9,11-14,21H2,1H3,(H2,22,23,24)/t16-,17+,20+/m0/s1
NCI pathway
Reactome pathway
US Patent
n/an/an/an/a>625n/an/an/an/a
Bristol-Myers Squibb Company
US Patent
Assay Description
Compounds were loaded in a 384 Falcon v-bottom plate (0.5 l/well in a 11 point, 3-fold dilution). Membranes prepared from S1P1/CHO cells or EDG3-Gal5...
US Patent US10166249 (2019)
BindingDB Entry DOI: 10.7270/Q2S75JCM
Sphingosine 1-phosphate receptor 1
(Homo sapiens (Human))
BDBM65041
(US10166249, Example 412 | US10709719, Example 412 ...)
Show SMILES CCCCCOC[C@@H]1COc2cc(ccc2O1)[C@H]1CC[C@](N)(COP(O)(O)=O)C1 |r|
Show InChI InChI=1S/C20H32NO7P/c1-2-3-4-9-25-12-17-13-26-19-10-15(5-6-18(19)28-17)16-7-8-20(21,11-16)14-27-29(22,23)24/h5-6,10,16-17H,2-4,7-9,11-14,21H2,1H3,(H2,22,23,24)/t16-,17+,20+/m0/s1
Reactome pathway
US Patent
n/an/a<10n/an/an/an/an/an/a
Bristol-Myers Squibb Company
US Patent
Assay Description
GTPγS:Compounds were loaded in a 384 Falcon v-bottom plate (0.5 μl/well in a 11 point, 3-fold dilution). Membranes prepared from S1P1/CHO c...
US Patent US10709719 (2020)
Sphingosine 1-phosphate receptor 1
(Homo sapiens (Human))
BDBM65041
(US10166249, Example 412 | US10709719, Example 412 ...)
Show SMILES CCCCCOC[C@@H]1COc2cc(ccc2O1)[C@H]1CC[C@](N)(COP(O)(O)=O)C1 |r|
Show InChI InChI=1S/C20H32NO7P/c1-2-3-4-9-25-12-17-13-26-19-10-15(5-6-18(19)28-17)16-7-8-20(21,11-16)14-27-29(22,23)24/h5-6,10,16-17H,2-4,7-9,11-14,21H2,1H3,(H2,22,23,24)/t16-,17+,20+/m0/s1
Reactome pathway
US Patent
n/an/a<10n/an/an/an/an/an/a
Bristol-Myers Squibb Company
US Patent
Assay Description
GTPγS:Compounds were loaded in a 384 Falcon v-bottom plate (0.5 μl/well in a 11 point, 3-fold dilution). Membranes prepared from S1P1/CHO c...
US Patent US10709719 (2020)
Sphingosine-1-phosphate lyase 1
(Homo sapiens (Human))
BDBM65041
(US10166249, Example 412 | US10709719, Example 412 ...)
Show SMILES CCCCCOC[C@@H]1COc2cc(ccc2O1)[C@H]1CC[C@](N)(COP(O)(O)=O)C1 |r|
Show InChI InChI=1S/C20H32NO7P/c1-2-3-4-9-25-12-17-13-26-19-10-15(5-6-18(19)28-17)16-7-8-20(21,11-16)14-27-29(22,23)24/h5-6,10,16-17H,2-4,7-9,11-14,21H2,1H3,(H2,22,23,24)/t16-,17+,20+/m0/s1
US Patent
n/an/an/an/a<10n/an/an/an/a
Bristol-Myers Squibb Company
US Patent
Assay Description
Compounds were loaded in a 384 Falcon v-bottom plate (0.5 l/well in a 11 point, 3-fold dilution). Membranes prepared from S1P1/CHO cells or EDG3-Gal5...
US Patent US10166249 (2019)
BindingDB Entry DOI: 10.7270/Q2S75JCM