null
SMILES: CCCCCO[C@H]1CCc2cc(ccc2C1)[C@@H]1CC[C@](N)(COP(O)(O)=O)C1
InChI Key: InChIKey=DLLAKINNLSLSAC-QHAWAJNXSA-N
Activity Spreadsheet -- Enzyme Inhibition Constant Data from BindingDB
Found 4 hits for monomerid = 65065
Trg + Lig
Ki
nM
ΔG°
kcal/mole
IC50
nM
Kd
nM
EC50/IC50
nM
koff
s-1
kon
M-1s-1
pHTemp
°C
Sphingosine 1-phosphate receptor 1
(Homo sapiens (Human))
BDBM65065
(US9522888, 434)
Show SMILES CCCCCO[C@H]1CCc2cc(ccc2C1)[C@@H]1CC[C@](N)(COP(O)(O)=O)C1 |r|
Show InChI InChI=1S/C21H34NO5P/c1-2-3-4-11-26-20-8-7-16-12-17(5-6-18(16)13-20)19-9-10-21(22,14-19)15-27-28(23,24)25/h5-6,12,19-20H,2-4,7-11,13-15,22H2,1H3,(H2,23,24,25)/t19-,20+,21-/m1/s1
Reactome pathway
US Patent
n/an/a<10n/an/an/an/a7.525
Bristol-Myers Squibb Company
US Patent
Assay Description
Membranes were prepared from CHO cells expressing human S1P1. Cells pellets (1x10^9 cells/pellet) were suspended in buffer containing 20 mM HEPES (4-...
US Patent US9522888 (2016)
BindingDB Entry DOI: 10.7270/Q20K27HV
Sphingosine 1-phosphate receptor 3
(Homo sapiens (Human))
BDBM65065
(US9522888, 434)
Show SMILES CCCCCO[C@H]1CCc2cc(ccc2C1)[C@@H]1CC[C@](N)(COP(O)(O)=O)C1 |r|
Show InChI InChI=1S/C21H34NO5P/c1-2-3-4-11-26-20-8-7-16-12-17(5-6-18(16)13-20)19-9-10-21(22,14-19)15-27-28(23,24)25/h5-6,12,19-20H,2-4,7-11,13-15,22H2,1H3,(H2,23,24,25)/t19-,20+,21-/m1/s1
NCI pathway
Reactome pathway
US Patent
n/an/an/an/a>625n/an/an/a60
Bristol-Myers Squibb Company
US Patent
Assay Description
Compounds were loaded in a 384 Falcon v-bottom plate (0.5 ul/well in a 11 point, 3-fold dilution). Membranes prepared from S1P1/CHO cells or EDG3-Gal...
US Patent US9522888 (2016)
BindingDB Entry DOI: 10.7270/Q20K27HV
Sphingosine 1-phosphate receptor 1
(Homo sapiens (Human))
BDBM65065
(US9522888, 434)
Show SMILES CCCCCO[C@H]1CCc2cc(ccc2C1)[C@@H]1CC[C@](N)(COP(O)(O)=O)C1 |r|
Show InChI InChI=1S/C21H34NO5P/c1-2-3-4-11-26-20-8-7-16-12-17(5-6-18(16)13-20)19-9-10-21(22,14-19)15-27-28(23,24)25/h5-6,12,19-20H,2-4,7-11,13-15,22H2,1H3,(H2,23,24,25)/t19-,20+,21-/m1/s1
Reactome pathway
US Patent
n/an/an/an/a<10n/an/an/a37
Bristol-Myers Squibb Company
US Patent
Assay Description
hS1P1/CHO cells were plated into BD Amine 384-well plates the day before the assay. On the day of the assay, growth medium was removed and replaced w...
US Patent US9522888 (2016)
BindingDB Entry DOI: 10.7270/Q20K27HV
Sphingosine 1-phosphate receptor 1
(Homo sapiens (Human))
BDBM65065
(US9522888, 434)
Show SMILES CCCCCO[C@H]1CCc2cc(ccc2C1)[C@@H]1CC[C@](N)(COP(O)(O)=O)C1 |r|
Show InChI InChI=1S/C21H34NO5P/c1-2-3-4-11-26-20-8-7-16-12-17(5-6-18(16)13-20)19-9-10-21(22,14-19)15-27-28(23,24)25/h5-6,12,19-20H,2-4,7-11,13-15,22H2,1H3,(H2,23,24,25)/t19-,20+,21-/m1/s1
Reactome pathway
US Patent
n/an/an/an/a 55n/an/an/a60
Bristol-Myers Squibb Company
US Patent
Assay Description
Compounds were loaded in a 384 Falcon v-bottom plate (0.5 ul/well in a 11 point, 3-fold dilution). Membranes prepared from S1P1/CHO cells or EDG3-Gal...
US Patent US9522888 (2016)
BindingDB Entry DOI: 10.7270/Q20K27HV