BDBM65110 US10166249, Example 473::US9522888, 473
SMILES: N[C@]1(COP(O)(O)=O)CC[C@@H](C1)c1ccc2C[C@H](COCc3ccsc3)CCc2c1
InChI Key: InChIKey=JSINUVSXPZTRLI-URZJWIJPSA-N
Data: 2 IC50  4 EC50
Activity Spreadsheet -- Enzyme Inhibition Constant Data from BindingDB
Found 6 hits for monomerid = 65110
Trg + Lig
Ki
nM
ΔG°
kcal/mole
IC50
nM
Kd
nM
EC50/IC50
nM
koff
s-1
kon
M-1s-1
pHTemp
°C
Sphingosine 1-phosphate receptor 1
(Homo sapiens (Human))
BDBM65110
(US10166249, Example 473 | US9522888, 473)
Show SMILES N[C@]1(COP(O)(O)=O)CC[C@@H](C1)c1ccc2C[C@H](COCc3ccsc3)CCc2c1 |r|
Show InChI InChI=1S/C22H30NO5PS/c23-22(15-28-29(24,25)26)7-5-21(11-22)20-4-3-18-9-16(1-2-19(18)10-20)12-27-13-17-6-8-30-14-17/h3-4,6,8,10,14,16,21H,1-2,5,7,9,11-13,15,23H2,(H2,24,25,26)/t16-,21+,22-/m1/s1
Reactome pathway
US Patent
n/an/a<10n/an/an/an/a7.525
Bristol-Myers Squibb Company
US Patent
Assay Description
Membranes were prepared from CHO cells expressing human S1P1. Cells pellets (1x10^9 cells/pellet) were suspended in buffer containing 20 mM HEPES (4-...
US Patent US9522888 (2016)
BindingDB Entry DOI: 10.7270/Q20K27HV
Sphingosine 1-phosphate receptor 1
(Homo sapiens (Human))
BDBM65110
(US10166249, Example 473 | US9522888, 473)
Show SMILES N[C@]1(COP(O)(O)=O)CC[C@@H](C1)c1ccc2C[C@H](COCc3ccsc3)CCc2c1 |r|
Show InChI InChI=1S/C22H30NO5PS/c23-22(15-28-29(24,25)26)7-5-21(11-22)20-4-3-18-9-16(1-2-19(18)10-20)12-27-13-17-6-8-30-14-17/h3-4,6,8,10,14,16,21H,1-2,5,7,9,11-13,15,23H2,(H2,24,25,26)/t16-,21+,22-/m1/s1
Reactome pathway
US Patent
n/an/an/an/a 55n/an/an/a37
Bristol-Myers Squibb Company
US Patent
Assay Description
hS1P1/CHO cells were plated into BD Amine 384-well plates the day before the assay. On the day of the assay, growth medium was removed and replaced w...
US Patent US9522888 (2016)
BindingDB Entry DOI: 10.7270/Q20K27HV
Sphingosine 1-phosphate receptor 3
(Homo sapiens (Human))
BDBM65110
(US10166249, Example 473 | US9522888, 473)
Show SMILES N[C@]1(COP(O)(O)=O)CC[C@@H](C1)c1ccc2C[C@H](COCc3ccsc3)CCc2c1 |r|
Show InChI InChI=1S/C22H30NO5PS/c23-22(15-28-29(24,25)26)7-5-21(11-22)20-4-3-18-9-16(1-2-19(18)10-20)12-27-13-17-6-8-30-14-17/h3-4,6,8,10,14,16,21H,1-2,5,7,9,11-13,15,23H2,(H2,24,25,26)/t16-,21+,22-/m1/s1
NCI pathway
Reactome pathway
US Patent
n/an/an/an/a>625n/an/an/an/a
Bristol-Myers Squibb Company
US Patent
Assay Description
Compounds were loaded in a 384 Falcon v-bottom plate (0.5 l/well in a 11 point, 3-fold dilution). Membranes prepared from S1P1/CHO cells or EDG3-Gal5...
US Patent US10166249 (2019)
BindingDB Entry DOI: 10.7270/Q2S75JCM
Sphingosine-1-phosphate lyase 1
(Homo sapiens (Human))
BDBM65110
(US10166249, Example 473 | US9522888, 473)
Show SMILES N[C@]1(COP(O)(O)=O)CC[C@@H](C1)c1ccc2C[C@H](COCc3ccsc3)CCc2c1 |r|
Show InChI InChI=1S/C22H30NO5PS/c23-22(15-28-29(24,25)26)7-5-21(11-22)20-4-3-18-9-16(1-2-19(18)10-20)12-27-13-17-6-8-30-14-17/h3-4,6,8,10,14,16,21H,1-2,5,7,9,11-13,15,23H2,(H2,24,25,26)/t16-,21+,22-/m1/s1
US Patent
n/an/a<10n/an/an/an/an/an/a
Bristol-Myers Squibb Company
US Patent
Assay Description
Membranes were prepared from CHO cells expressing human S1P1. Cells pellets (1×109 cells/pellet) were suspended in buffer containing 20 mM HEPES (4-(...
US Patent US10166249 (2019)
BindingDB Entry DOI: 10.7270/Q2S75JCM
Sphingosine-1-phosphate lyase 1
(Homo sapiens (Human))
BDBM65110
(US10166249, Example 473 | US9522888, 473)
Show SMILES N[C@]1(COP(O)(O)=O)CC[C@@H](C1)c1ccc2C[C@H](COCc3ccsc3)CCc2c1 |r|
Show InChI InChI=1S/C22H30NO5PS/c23-22(15-28-29(24,25)26)7-5-21(11-22)20-4-3-18-9-16(1-2-19(18)10-20)12-27-13-17-6-8-30-14-17/h3-4,6,8,10,14,16,21H,1-2,5,7,9,11-13,15,23H2,(H2,24,25,26)/t16-,21+,22-/m1/s1
US Patent
n/an/an/an/a 55n/an/an/an/a
Bristol-Myers Squibb Company
US Patent
Assay Description
hS1P1/CHO cells were plated into BD Amine 384-well plates the day before the assay. On the day of the assay, growth medium was removed and replaced w...
US Patent US10166249 (2019)
BindingDB Entry DOI: 10.7270/Q2S75JCM
Sphingosine 1-phosphate receptor 3
(Homo sapiens (Human))
BDBM65110
(US10166249, Example 473 | US9522888, 473)
Show SMILES N[C@]1(COP(O)(O)=O)CC[C@@H](C1)c1ccc2C[C@H](COCc3ccsc3)CCc2c1 |r|
Show InChI InChI=1S/C22H30NO5PS/c23-22(15-28-29(24,25)26)7-5-21(11-22)20-4-3-18-9-16(1-2-19(18)10-20)12-27-13-17-6-8-30-14-17/h3-4,6,8,10,14,16,21H,1-2,5,7,9,11-13,15,23H2,(H2,24,25,26)/t16-,21+,22-/m1/s1
NCI pathway
Reactome pathway
US Patent
n/an/an/an/a>625n/an/an/a60
Bristol-Myers Squibb Company
US Patent
Assay Description
Compounds were loaded in a 384 Falcon v-bottom plate (0.5 ul/well in a 11 point, 3-fold dilution). Membranes prepared from S1P1/CHO cells or EDG3-Gal...
US Patent US9522888 (2016)
BindingDB Entry DOI: 10.7270/Q20K27HV