null
SMILES: COc1cncc(OC[C@@H]2CCc3cc(ccc3C2)[C@H]2CC[C@](N)(COP(O)(O)=O)C2)c1
InChI Key: InChIKey=UMMQYXKEQISLQU-NIJIEXERSA-N
Activity Spreadsheet -- Enzyme Inhibition Constant Data from BindingDB
Found 8 hits for monomerid = 65119
Trg + Lig
Ki
nM
ΔG°
kcal/mole
IC50
nM
Kd
nM
EC50/IC50
nM
koff
s-1
kon
M-1s-1
pHTemp
°C
Sphingosine 1-phosphate receptor 1
(Homo sapiens (Human))
BDBM65119
(US10166249, Example 477 | US9522888, 477)
Show SMILES COc1cncc(OC[C@@H]2CCc3cc(ccc3C2)[C@H]2CC[C@](N)(COP(O)(O)=O)C2)c1 |r|
Show InChI InChI=1S/C23H31N2O6P/c1-29-21-10-22(13-25-12-21)30-14-16-2-3-18-9-19(5-4-17(18)8-16)20-6-7-23(24,11-20)15-31-32(26,27)28/h4-5,9-10,12-13,16,20H,2-3,6-8,11,14-15,24H2,1H3,(H2,26,27,28)/t16-,20+,23-/m1/s1
Reactome pathway
US Patent
n/an/a<10n/an/an/an/a7.525
Bristol-Myers Squibb Company
US Patent
Assay Description
Membranes were prepared from CHO cells expressing human S1P1. Cells pellets (1x10^9 cells/pellet) were suspended in buffer containing 20 mM HEPES (4-...
US Patent US9522888 (2016)
BindingDB Entry DOI: 10.7270/Q20K27HV
Sphingosine 1-phosphate receptor 1
(Homo sapiens (Human))
BDBM65119
(US10166249, Example 477 | US9522888, 477)
Show SMILES COc1cncc(OC[C@@H]2CCc3cc(ccc3C2)[C@H]2CC[C@](N)(COP(O)(O)=O)C2)c1 |r|
Show InChI InChI=1S/C23H31N2O6P/c1-29-21-10-22(13-25-12-21)30-14-16-2-3-18-9-19(5-4-17(18)8-16)20-6-7-23(24,11-20)15-31-32(26,27)28/h4-5,9-10,12-13,16,20H,2-3,6-8,11,14-15,24H2,1H3,(H2,26,27,28)/t16-,20+,23-/m1/s1
Reactome pathway
US Patent
n/an/an/an/a 55n/an/an/a60
Bristol-Myers Squibb Company
US Patent
Assay Description
Compounds were loaded in a 384 Falcon v-bottom plate (0.5 ul/well in a 11 point, 3-fold dilution). Membranes prepared from S1P1/CHO cells or EDG3-Gal...
US Patent US9522888 (2016)
BindingDB Entry DOI: 10.7270/Q20K27HV
Sphingosine 1-phosphate receptor 1
(Homo sapiens (Human))
BDBM65119
(US10166249, Example 477 | US9522888, 477)
Show SMILES COc1cncc(OC[C@@H]2CCc3cc(ccc3C2)[C@H]2CC[C@](N)(COP(O)(O)=O)C2)c1 |r|
Show InChI InChI=1S/C23H31N2O6P/c1-29-21-10-22(13-25-12-21)30-14-16-2-3-18-9-19(5-4-17(18)8-16)20-6-7-23(24,11-20)15-31-32(26,27)28/h4-5,9-10,12-13,16,20H,2-3,6-8,11,14-15,24H2,1H3,(H2,26,27,28)/t16-,20+,23-/m1/s1
Reactome pathway
US Patent
n/an/an/an/a<10n/an/an/a37
Bristol-Myers Squibb Company
US Patent
Assay Description
hS1P1/CHO cells were plated into BD Amine 384-well plates the day before the assay. On the day of the assay, growth medium was removed and replaced w...
US Patent US9522888 (2016)
BindingDB Entry DOI: 10.7270/Q20K27HV
Sphingosine 1-phosphate receptor 3
(Homo sapiens (Human))
BDBM65119
(US10166249, Example 477 | US9522888, 477)
Show SMILES COc1cncc(OC[C@@H]2CCc3cc(ccc3C2)[C@H]2CC[C@](N)(COP(O)(O)=O)C2)c1 |r|
Show InChI InChI=1S/C23H31N2O6P/c1-29-21-10-22(13-25-12-21)30-14-16-2-3-18-9-19(5-4-17(18)8-16)20-6-7-23(24,11-20)15-31-32(26,27)28/h4-5,9-10,12-13,16,20H,2-3,6-8,11,14-15,24H2,1H3,(H2,26,27,28)/t16-,20+,23-/m1/s1
NCI pathway
Reactome pathway
US Patent
n/an/an/an/a>625n/an/an/an/a
Bristol-Myers Squibb Company
US Patent
Assay Description
Compounds were loaded in a 384 Falcon v-bottom plate (0.5 l/well in a 11 point, 3-fold dilution). Membranes prepared from S1P1/CHO cells or EDG3-Gal5...
US Patent US10166249 (2019)
BindingDB Entry DOI: 10.7270/Q2S75JCM
Sphingosine-1-phosphate lyase 1
(Homo sapiens (Human))
BDBM65119
(US10166249, Example 477 | US9522888, 477)
Show SMILES COc1cncc(OC[C@@H]2CCc3cc(ccc3C2)[C@H]2CC[C@](N)(COP(O)(O)=O)C2)c1 |r|
Show InChI InChI=1S/C23H31N2O6P/c1-29-21-10-22(13-25-12-21)30-14-16-2-3-18-9-19(5-4-17(18)8-16)20-6-7-23(24,11-20)15-31-32(26,27)28/h4-5,9-10,12-13,16,20H,2-3,6-8,11,14-15,24H2,1H3,(H2,26,27,28)/t16-,20+,23-/m1/s1
US Patent
n/an/a<10n/an/an/an/an/an/a
Bristol-Myers Squibb Company
US Patent
Assay Description
Membranes were prepared from CHO cells expressing human S1P1. Cells pellets (1×109 cells/pellet) were suspended in buffer containing 20 mM HEPES (4-(...
US Patent US10166249 (2019)
BindingDB Entry DOI: 10.7270/Q2S75JCM
Sphingosine-1-phosphate lyase 1
(Homo sapiens (Human))
BDBM65119
(US10166249, Example 477 | US9522888, 477)
Show SMILES COc1cncc(OC[C@@H]2CCc3cc(ccc3C2)[C@H]2CC[C@](N)(COP(O)(O)=O)C2)c1 |r|
Show InChI InChI=1S/C23H31N2O6P/c1-29-21-10-22(13-25-12-21)30-14-16-2-3-18-9-19(5-4-17(18)8-16)20-6-7-23(24,11-20)15-31-32(26,27)28/h4-5,9-10,12-13,16,20H,2-3,6-8,11,14-15,24H2,1H3,(H2,26,27,28)/t16-,20+,23-/m1/s1
US Patent
n/an/an/an/a 55n/an/an/an/a
Bristol-Myers Squibb Company
US Patent
Assay Description
Compounds were loaded in a 384 Falcon v-bottom plate (0.5 l/well in a 11 point, 3-fold dilution). Membranes prepared from S1P1/CHO cells or EDG3-Gal5...
US Patent US10166249 (2019)
BindingDB Entry DOI: 10.7270/Q2S75JCM
Sphingosine-1-phosphate lyase 1
(Homo sapiens (Human))
BDBM65119
(US10166249, Example 477 | US9522888, 477)
Show SMILES COc1cncc(OC[C@@H]2CCc3cc(ccc3C2)[C@H]2CC[C@](N)(COP(O)(O)=O)C2)c1 |r|
Show InChI InChI=1S/C23H31N2O6P/c1-29-21-10-22(13-25-12-21)30-14-16-2-3-18-9-19(5-4-17(18)8-16)20-6-7-23(24,11-20)15-31-32(26,27)28/h4-5,9-10,12-13,16,20H,2-3,6-8,11,14-15,24H2,1H3,(H2,26,27,28)/t16-,20+,23-/m1/s1
US Patent
n/an/an/an/a<10n/an/an/an/a
Bristol-Myers Squibb Company
US Patent
Assay Description
hS1P1/CHO cells were plated into BD Amine 384-well plates the day before the assay. On the day of the assay, growth medium was removed and replaced w...
US Patent US10166249 (2019)
BindingDB Entry DOI: 10.7270/Q2S75JCM
Sphingosine 1-phosphate receptor 3
(Homo sapiens (Human))
BDBM65119
(US10166249, Example 477 | US9522888, 477)
Show SMILES COc1cncc(OC[C@@H]2CCc3cc(ccc3C2)[C@H]2CC[C@](N)(COP(O)(O)=O)C2)c1 |r|
Show InChI InChI=1S/C23H31N2O6P/c1-29-21-10-22(13-25-12-21)30-14-16-2-3-18-9-19(5-4-17(18)8-16)20-6-7-23(24,11-20)15-31-32(26,27)28/h4-5,9-10,12-13,16,20H,2-3,6-8,11,14-15,24H2,1H3,(H2,26,27,28)/t16-,20+,23-/m1/s1
NCI pathway
Reactome pathway
US Patent
n/an/an/an/a>625n/an/an/a60
Bristol-Myers Squibb Company
US Patent
Assay Description
Compounds were loaded in a 384 Falcon v-bottom plate (0.5 ul/well in a 11 point, 3-fold dilution). Membranes prepared from S1P1/CHO cells or EDG3-Gal...
US Patent US9522888 (2016)
BindingDB Entry DOI: 10.7270/Q20K27HV