null
SMILES: [#6]C1([#6])[#6]-[#6](=[#6]\[#6](-[#6]1)=[#7+]-1/[#6]-[#6]-[#6]-[#6]-1)-[#7]-1-[#6]-[#6]-[#6]-[#6]-1
InChI Key: InChIKey=JHLURTREAGIFPK-UHFFFAOYSA-N
Activity Spreadsheet -- Enzyme Inhibition Constant Data from BindingDB
Found 3 hits for monomerid = 65214
Trg + Lig
Ki
nM
ΔG°
kcal/mole
IC50
nM
Kd
nM
EC50/IC50
nM
koff
s-1
kon
M-1s-1
pHTemp
°C
DNA dC->dU-editing enzyme APOBEC-3A
(Homo sapiens (Human))
BDBM65214
(1-(5,5-dimethyl-3-pyrrolidin-1-ium-1-ylidene-cyclo...)
Show SMILES [#6]C1([#6])[#6]-[#6](=[#6]\[#6](-[#6]1)=[#7+]-1/[#6]-[#6]-[#6]-[#6]-1)-[#7]-1-[#6]-[#6]-[#6]-[#6]-1 |c:4|
Show InChI InChI=1S/C16H27N2/c1-16(2)12-14(17-7-3-4-8-17)11-15(13-16)18-9-5-6-10-18/h11H,3-10,12-13H2,1-2H3/q+1
PCBioAssay
n/an/a 1.53E+3n/an/an/an/an/a25
Burnham Center for Chemical Genomics
Curated by PubChem BioAssay
Assay Description
Data Source: Sanford-Burnham Center for Chemical Genomics (SBCCG) Source Affiliation: Sanford-Burnham Medical Research Institute (SBMRI, San Diego, C...
PubChem Bioassay (2011)
BindingDB Entry DOI: 10.7270/Q24F1P6P
Carboxy-terminal domain RNA polymerase II polypeptide A small phosphatase 1
(Homo sapiens (Human))
BDBM65214
(1-(5,5-dimethyl-3-pyrrolidin-1-ium-1-ylidene-cyclo...)
Show SMILES [#6]C1([#6])[#6]-[#6](=[#6]\[#6](-[#6]1)=[#7+]-1/[#6]-[#6]-[#6]-[#6]-1)-[#7]-1-[#6]-[#6]-[#6]-[#6]-1 |c:4|
Show InChI InChI=1S/C16H27N2/c1-16(2)12-14(17-7-3-4-8-17)11-15(13-16)18-9-5-6-10-18/h11H,3-10,12-13H2,1-2H3/q+1
PCBioAssay
n/an/a 3.62E+3n/an/an/an/an/an/a
Burnham Center for Chemical Genomics
Curated by PubChem BioAssay
Assay Description
Data Source: Sanford-Burnham Center for Chemical Genomics (SBCCG) Source Affiliation: Sanford-Burnham Medical Research Institute (SBMRI, San Diego, C...
PubChem Bioassay (2011)
BindingDB Entry DOI: 10.7270/Q2V986KM
DNA dC->dU-editing enzyme APOBEC-3G
(Homo sapiens (Human))
BDBM65214
(1-(5,5-dimethyl-3-pyrrolidin-1-ium-1-ylidene-cyclo...)
Show SMILES [#6]C1([#6])[#6]-[#6](=[#6]\[#6](-[#6]1)=[#7+]-1/[#6]-[#6]-[#6]-[#6]-1)-[#7]-1-[#6]-[#6]-[#6]-[#6]-1 |c:4|
Show InChI InChI=1S/C16H27N2/c1-16(2)12-14(17-7-3-4-8-17)11-15(13-16)18-9-5-6-10-18/h11H,3-10,12-13H2,1-2H3/q+1
PCBioAssay
n/an/a 1.47E+3n/an/an/an/an/a25
Burnham Center for Chemical Genomics
Curated by PubChem BioAssay
Assay Description
Data Source: Sanford-Burnham Center for Chemical Genomics (SBCCG) Source Affiliation: Sanford-Burnham Medical Research Institute (SBMRI, San Diego, C...
PubChem Bioassay (2011)
BindingDB Entry DOI: 10.7270/Q2862DX0