null
SMILES: COCc1cccc(C[C@@H]2CCc3cc(ccc3C2)[C@H]2CC[C@](N)(COP(O)(O)=O)C2)c1
InChI Key: InChIKey=MSGPJOORVUJSGK-PNTFMKQHSA-N
Activity Spreadsheet -- Enzyme Inhibition Constant Data from BindingDB
Found 8 hits for monomerid = 65217
Trg + Lig
Ki
nM
ΔG°
kcal/mole
IC50
nM
Kd
nM
EC50/IC50
nM
koff
s-1
kon
M-1s-1
pHTemp
°C
Sphingosine 1-phosphate receptor 1
(Homo sapiens (Human))
BDBM65217
(US10166249, Example 552 | US9522888, 552)
Show SMILES COCc1cccc(C[C@@H]2CCc3cc(ccc3C2)[C@H]2CC[C@](N)(COP(O)(O)=O)C2)c1 |r|
Show InChI InChI=1S/C25H34NO5P/c1-30-16-20-4-2-3-18(12-20)11-19-5-6-22-14-23(8-7-21(22)13-19)24-9-10-25(26,15-24)17-31-32(27,28)29/h2-4,7-8,12,14,19,24H,5-6,9-11,13,15-17,26H2,1H3,(H2,27,28,29)/t19-,24-,25+/m0/s1
Reactome pathway
US Patent
n/an/a<10n/an/an/an/a7.525
Bristol-Myers Squibb Company
US Patent
Assay Description
Membranes were prepared from CHO cells expressing human S1P1. Cells pellets (1x10^9 cells/pellet) were suspended in buffer containing 20 mM HEPES (4-...
US Patent US9522888 (2016)
BindingDB Entry DOI: 10.7270/Q20K27HV
Sphingosine 1-phosphate receptor 1
(Homo sapiens (Human))
BDBM65217
(US10166249, Example 552 | US9522888, 552)
Show SMILES COCc1cccc(C[C@@H]2CCc3cc(ccc3C2)[C@H]2CC[C@](N)(COP(O)(O)=O)C2)c1 |r|
Show InChI InChI=1S/C25H34NO5P/c1-30-16-20-4-2-3-18(12-20)11-19-5-6-22-14-23(8-7-21(22)13-19)24-9-10-25(26,15-24)17-31-32(27,28)29/h2-4,7-8,12,14,19,24H,5-6,9-11,13,15-17,26H2,1H3,(H2,27,28,29)/t19-,24-,25+/m0/s1
Reactome pathway
US Patent
n/an/an/an/a 55n/an/an/a60
Bristol-Myers Squibb Company
US Patent
Assay Description
Compounds were loaded in a 384 Falcon v-bottom plate (0.5 ul/well in a 11 point, 3-fold dilution). Membranes prepared from S1P1/CHO cells or EDG3-Gal...
US Patent US9522888 (2016)
BindingDB Entry DOI: 10.7270/Q20K27HV
Sphingosine 1-phosphate receptor 1
(Homo sapiens (Human))
BDBM65217
(US10166249, Example 552 | US9522888, 552)
Show SMILES COCc1cccc(C[C@@H]2CCc3cc(ccc3C2)[C@H]2CC[C@](N)(COP(O)(O)=O)C2)c1 |r|
Show InChI InChI=1S/C25H34NO5P/c1-30-16-20-4-2-3-18(12-20)11-19-5-6-22-14-23(8-7-21(22)13-19)24-9-10-25(26,15-24)17-31-32(27,28)29/h2-4,7-8,12,14,19,24H,5-6,9-11,13,15-17,26H2,1H3,(H2,27,28,29)/t19-,24-,25+/m0/s1
Reactome pathway
US Patent
n/an/an/an/a 55n/an/an/a37
Bristol-Myers Squibb Company
US Patent
Assay Description
hS1P1/CHO cells were plated into BD Amine 384-well plates the day before the assay. On the day of the assay, growth medium was removed and replaced w...
US Patent US9522888 (2016)
BindingDB Entry DOI: 10.7270/Q20K27HV
Sphingosine 1-phosphate receptor 3
(Homo sapiens (Human))
BDBM65217
(US10166249, Example 552 | US9522888, 552)
Show SMILES COCc1cccc(C[C@@H]2CCc3cc(ccc3C2)[C@H]2CC[C@](N)(COP(O)(O)=O)C2)c1 |r|
Show InChI InChI=1S/C25H34NO5P/c1-30-16-20-4-2-3-18(12-20)11-19-5-6-22-14-23(8-7-21(22)13-19)24-9-10-25(26,15-24)17-31-32(27,28)29/h2-4,7-8,12,14,19,24H,5-6,9-11,13,15-17,26H2,1H3,(H2,27,28,29)/t19-,24-,25+/m0/s1
NCI pathway
Reactome pathway
US Patent
n/an/an/an/a>625n/an/an/an/a
Bristol-Myers Squibb Company
US Patent
Assay Description
Compounds were loaded in a 384 Falcon v-bottom plate (0.5 l/well in a 11 point, 3-fold dilution). Membranes prepared from S1P1/CHO cells or EDG3-Gal5...
US Patent US10166249 (2019)
BindingDB Entry DOI: 10.7270/Q2S75JCM
Sphingosine-1-phosphate lyase 1
(Homo sapiens (Human))
BDBM65217
(US10166249, Example 552 | US9522888, 552)
Show SMILES COCc1cccc(C[C@@H]2CCc3cc(ccc3C2)[C@H]2CC[C@](N)(COP(O)(O)=O)C2)c1 |r|
Show InChI InChI=1S/C25H34NO5P/c1-30-16-20-4-2-3-18(12-20)11-19-5-6-22-14-23(8-7-21(22)13-19)24-9-10-25(26,15-24)17-31-32(27,28)29/h2-4,7-8,12,14,19,24H,5-6,9-11,13,15-17,26H2,1H3,(H2,27,28,29)/t19-,24-,25+/m0/s1
US Patent
n/an/a<10n/an/an/an/an/an/a
Bristol-Myers Squibb Company
US Patent
Assay Description
Membranes were prepared from CHO cells expressing human S1P1. Cells pellets (1×109 cells/pellet) were suspended in buffer containing 20 mM HEPES (4-(...
US Patent US10166249 (2019)
BindingDB Entry DOI: 10.7270/Q2S75JCM
Sphingosine-1-phosphate lyase 1
(Homo sapiens (Human))
BDBM65217
(US10166249, Example 552 | US9522888, 552)
Show SMILES COCc1cccc(C[C@@H]2CCc3cc(ccc3C2)[C@H]2CC[C@](N)(COP(O)(O)=O)C2)c1 |r|
Show InChI InChI=1S/C25H34NO5P/c1-30-16-20-4-2-3-18(12-20)11-19-5-6-22-14-23(8-7-21(22)13-19)24-9-10-25(26,15-24)17-31-32(27,28)29/h2-4,7-8,12,14,19,24H,5-6,9-11,13,15-17,26H2,1H3,(H2,27,28,29)/t19-,24-,25+/m0/s1
US Patent
n/an/an/an/a 55n/an/an/an/a
Bristol-Myers Squibb Company
US Patent
Assay Description
Compounds were loaded in a 384 Falcon v-bottom plate (0.5 l/well in a 11 point, 3-fold dilution). Membranes prepared from S1P1/CHO cells or EDG3-Gal5...
US Patent US10166249 (2019)
BindingDB Entry DOI: 10.7270/Q2S75JCM
Sphingosine-1-phosphate lyase 1
(Homo sapiens (Human))
BDBM65217
(US10166249, Example 552 | US9522888, 552)
Show SMILES COCc1cccc(C[C@@H]2CCc3cc(ccc3C2)[C@H]2CC[C@](N)(COP(O)(O)=O)C2)c1 |r|
Show InChI InChI=1S/C25H34NO5P/c1-30-16-20-4-2-3-18(12-20)11-19-5-6-22-14-23(8-7-21(22)13-19)24-9-10-25(26,15-24)17-31-32(27,28)29/h2-4,7-8,12,14,19,24H,5-6,9-11,13,15-17,26H2,1H3,(H2,27,28,29)/t19-,24-,25+/m0/s1
US Patent
n/an/an/an/a 55n/an/an/an/a
Bristol-Myers Squibb Company
US Patent
Assay Description
hS1P1/CHO cells were plated into BD Amine 384-well plates the day before the assay. On the day of the assay, growth medium was removed and replaced w...
US Patent US10166249 (2019)
BindingDB Entry DOI: 10.7270/Q2S75JCM
Sphingosine 1-phosphate receptor 3
(Homo sapiens (Human))
BDBM65217
(US10166249, Example 552 | US9522888, 552)
Show SMILES COCc1cccc(C[C@@H]2CCc3cc(ccc3C2)[C@H]2CC[C@](N)(COP(O)(O)=O)C2)c1 |r|
Show InChI InChI=1S/C25H34NO5P/c1-30-16-20-4-2-3-18(12-20)11-19-5-6-22-14-23(8-7-21(22)13-19)24-9-10-25(26,15-24)17-31-32(27,28)29/h2-4,7-8,12,14,19,24H,5-6,9-11,13,15-17,26H2,1H3,(H2,27,28,29)/t19-,24-,25+/m0/s1
NCI pathway
Reactome pathway
US Patent
n/an/an/an/a>625n/an/an/a60
Bristol-Myers Squibb Company
US Patent
Assay Description
Compounds were loaded in a 384 Falcon v-bottom plate (0.5 ul/well in a 11 point, 3-fold dilution). Membranes prepared from S1P1/CHO cells or EDG3-Gal...
US Patent US9522888 (2016)
BindingDB Entry DOI: 10.7270/Q20K27HV