BDBM656 (3R,4R)-N-benzyl-4-{[(2R,4S)-2-[(R)-(benzylcarbamoyl)(1-phenylacetamido)methyl]-5,5-dimethyl-1,3-thiazolidin-4-yl]formamido}-3-hydroxy-5-phenylpentanamide::penicillin deriv. 69
SMILES: [H][C@]1(N[C@@H](C(=O)N[C@H](Cc2ccccc2)[C@H](O)CC(=O)NCc2ccccc2)C(C)(C)S1)[C@H](NC(=O)Cc1ccccc1)C(=O)NCc1ccccc1
InChI Key: InChIKey=RNBNABRBLMLESP-AVVHONGESA-N
Data: 1 IC50
PDB links: 1 PDB ID contains inhibitors having a similarity of 90% to this monomer.
Activity Spreadsheet -- Enzyme Inhibition Constant Data from BindingDB
Found 1 hit for monomerid = 656
Trg + Lig
Ki
nM
ΔG°
kcal/mole
IC50
nM
Kd
nM
EC50/IC50
nM
koff
s-1
kon
M-1s-1
pHTemp
°C
HIV-1 Protease
(Human immunodeficiency virus type 1)
BDBM656
((3R,4R)-N-benzyl-4-{[(2R,4S)-2-[(R)-(benzylcarbamo...)
Show SMILES [H][C@]1(N[C@@H](C(=O)N[C@H](Cc2ccccc2)[C@H](O)CC(=O)NCc2ccccc2)C(C)(C)S1)[C@H](NC(=O)Cc1ccccc1)C(=O)NCc1ccccc1 |r|
Show InChI InChI=1S/C41H47N5O5S/c1-41(2)37(39(51)44-32(23-28-15-7-3-8-16-28)33(47)25-34(48)42-26-30-19-11-5-12-20-30)46-40(52-41)36(38(50)43-27-31-21-13-6-14-22-31)45-35(49)24-29-17-9-4-10-18-29/h3-22,32-33,36-37,40,46-47H,23-27H2,1-2H3,(H,42,48)(H,43,50)(H,44,51)(H,45,49)/t32-,33-,36-,37+,40-/m1/s1
n/an/a 4.60n/an/an/an/a6.037
Glaxo Group Research Ltd.
Assay Description
IC50 values were obtained by assaying the enzyme against the synthetic substrate peptide KQGTVSFNFPQIT, which was tritiated at the proline residue, a...
J Med Chem 36: 3129-36 (1993)
Article DOI: 10.1021/jm00073a012
BindingDB Entry DOI: 10.7270/Q20P0X6C