BDBM65667 US9693997, 63
SMILES: CC1(O)CN(C1)S(=O)(=O)c1ccc(cc1)-c1c(Cl)cc(Nc2n[nH]c(N)n2)cc1C(F)(F)F
InChI Key: InChIKey=QUGLKABXWPZKJC-UHFFFAOYSA-N
Data: 1 EC50
Activity Spreadsheet -- Enzyme Inhibition Constant Data from BindingDB
Found 1 hit for monomerid = 65667
Trg + Lig
Ki
nM
ΔG°
kcal/mole
IC50
nM
Kd
nM
EC50/IC50
nM
koff
s-1
kon
M-1s-1
pHTemp
°C
Genome polyprotein
(Hepatitis C virus (HCV genotype 1a, isolate H))
BDBM65667
(US9693997, 63)
Show SMILES CC1(O)CN(C1)S(=O)(=O)c1ccc(cc1)-c1c(Cl)cc(Nc2n[nH]c(N)n2)cc1C(F)(F)F |$;;;;;;;;;;;;;;;;;;;;;;;HN;;;;;;;;;$|
Show InChI InChI=1S/C19H18ClF3N6O3S/c1-18(30)8-29(9-18)33(31,32)12-4-2-10(3-5-12)15-13(19(21,22)23)6-11(7-14(15)20)25-17-26-16(24)27-28-17/h2-7,30H,8-9H2,1H3,(H4,24,25,26,27,28)
US Patent
n/an/an/an/a 18n/an/an/an/a
HOFFMANN-LA ROCHE INC.
US Patent
Assay Description
Plasmids expressing HCV E1 and E2 envelope proteins of GT1a H77 strain (Proc Natl Acad Sci USA 1997 94:8738-43) or GT1b Con1 strain (Science 1999 285...
US Patent US9693997 (2017)
BindingDB Entry DOI: 10.7270/Q2833Q56