BDBM6570 6-(2,6-dichlorophenyl)-2-[(4-ethoxyphenyl)amino]-8-methyl-7H,8H-pyrido[2,3-d]pyrimidin-7-one::PD173958
SMILES: CCOc1ccc(Nc2ncc3cc(-c4c(Cl)cccc4Cl)c(=O)n(C)c3n2)cc1
InChI Key: InChIKey=AFZKXALTXCNQAZ-UHFFFAOYSA-N
Data: 4 IC50
Activity Spreadsheet -- Enzyme Inhibition Constant Data from BindingDB
Found 4 hits for monomerid = 6570
Trg + Lig
Ki
nM
ΔG°
kcal/mole
IC50
nM
Kd
nM
EC50/IC50
nM
koff
s-1
kon
M-1s-1
pHTemp
°C
Proto-oncogene tyrosine-protein kinase Src
(Homo sapiens (Human))
BDBM6570
(6-(2,6-dichlorophenyl)-2-[(4-ethoxyphenyl)amino]-8...)
Show SMILES CCOc1ccc(Nc2ncc3cc(-c4c(Cl)cccc4Cl)c(=O)n(C)c3n2)cc1 |(-13.51,4.17,;-12.18,3.4,;-10.84,4.17,;-9.51,3.4,;-9.51,1.86,;-8.18,1.08,;-6.84,1.86,;-5.51,1.08,;-4.18,1.85,;-4.18,3.39,;-2.84,4.16,;-1.51,3.4,;-.18,4.17,;1.16,3.4,;2.49,4.17,;2.49,5.71,;1.16,6.48,;3.83,6.48,;5.16,5.71,;5.16,4.17,;3.83,3.39,;3.83,1.85,;1.16,1.86,;2.49,1.09,;-.18,1.09,;-.18,-.45,;-1.51,1.86,;-2.84,1.08,;-6.84,3.4,;-8.18,4.17,)|
Show InChI InChI=1S/C22H18Cl2N4O2/c1-3-30-15-9-7-14(8-10-15)26-22-25-12-13-11-16(21(29)28(2)20(13)27-22)19-17(23)5-4-6-18(19)24/h4-12H,3H2,1-2H3,(H,25,26,27)
n/an/a 16.3n/an/an/an/a7.525
Parke-Davis Pharmaceutical Research
Assay Description
IC50 is the inhibitor concentration which inhibits 50% of kinase activity that catalyzes the transfer of the terminal phosphate from [gamma-32P] labe...
Biochem Pharmacol 60: 885-98 (2000)
Article DOI: 10.1016/s0006-2952(00)00405-6
BindingDB Entry DOI: 10.7270/Q2MC8X7B
Tyrosine-protein kinase Lck
(Homo sapiens (Human))
BDBM6570
(6-(2,6-dichlorophenyl)-2-[(4-ethoxyphenyl)amino]-8...)
Show SMILES CCOc1ccc(Nc2ncc3cc(-c4c(Cl)cccc4Cl)c(=O)n(C)c3n2)cc1 |(-13.51,4.17,;-12.18,3.4,;-10.84,4.17,;-9.51,3.4,;-9.51,1.86,;-8.18,1.08,;-6.84,1.86,;-5.51,1.08,;-4.18,1.85,;-4.18,3.39,;-2.84,4.16,;-1.51,3.4,;-.18,4.17,;1.16,3.4,;2.49,4.17,;2.49,5.71,;1.16,6.48,;3.83,6.48,;5.16,5.71,;5.16,4.17,;3.83,3.39,;3.83,1.85,;1.16,1.86,;2.49,1.09,;-.18,1.09,;-.18,-.45,;-1.51,1.86,;-2.84,1.08,;-6.84,3.4,;-8.18,4.17,)|
Show InChI InChI=1S/C22H18Cl2N4O2/c1-3-30-15-9-7-14(8-10-15)26-22-25-12-13-11-16(21(29)28(2)20(13)27-22)19-17(23)5-4-6-18(19)24/h4-12H,3H2,1-2H3,(H,25,26,27)
n/an/a<5n/an/an/an/an/an/a
Parke-Davis Pharmaceutical Research
Assay Description
The kinase activity was measured by DELFIA/time-resolved fluorometry. The reaction was carried out in 96-well polypropylene plates and was terminated...
Biochem Pharmacol 60: 885-98 (2000)
Article DOI: 10.1016/s0006-2952(00)00405-6
BindingDB Entry DOI: 10.7270/Q2MC8X7B
Platelet-derived growth factor receptor beta
(Homo sapiens (Human))
BDBM6570
(6-(2,6-dichlorophenyl)-2-[(4-ethoxyphenyl)amino]-8...)
Show SMILES CCOc1ccc(Nc2ncc3cc(-c4c(Cl)cccc4Cl)c(=O)n(C)c3n2)cc1 |(-13.51,4.17,;-12.18,3.4,;-10.84,4.17,;-9.51,3.4,;-9.51,1.86,;-8.18,1.08,;-6.84,1.86,;-5.51,1.08,;-4.18,1.85,;-4.18,3.39,;-2.84,4.16,;-1.51,3.4,;-.18,4.17,;1.16,3.4,;2.49,4.17,;2.49,5.71,;1.16,6.48,;3.83,6.48,;5.16,5.71,;5.16,4.17,;3.83,3.39,;3.83,1.85,;1.16,1.86,;2.49,1.09,;-.18,1.09,;-.18,-.45,;-1.51,1.86,;-2.84,1.08,;-6.84,3.4,;-8.18,4.17,)|
Show InChI InChI=1S/C22H18Cl2N4O2/c1-3-30-15-9-7-14(8-10-15)26-22-25-12-13-11-16(21(29)28(2)20(13)27-22)19-17(23)5-4-6-18(19)24/h4-12H,3H2,1-2H3,(H,25,26,27)
NCI pathway
Reactome pathway
n/an/a 2.34E+3n/an/an/an/a7.425
Parke-Davis Pharmaceutical Research
Assay Description
IC50 is the inhibitor concentration which inhibits 50% of kinase activity that catalyzes the transfer of the terminal phosphate from [gamma-32P] labe...
Biochem Pharmacol 60: 885-98 (2000)
Article DOI: 10.1016/s0006-2952(00)00405-6
BindingDB Entry DOI: 10.7270/Q2MC8X7B
Fibroblast growth factor receptor 1
(Homo sapiens (Human))
BDBM6570
(6-(2,6-dichlorophenyl)-2-[(4-ethoxyphenyl)amino]-8...)
Show SMILES CCOc1ccc(Nc2ncc3cc(-c4c(Cl)cccc4Cl)c(=O)n(C)c3n2)cc1 |(-13.51,4.17,;-12.18,3.4,;-10.84,4.17,;-9.51,3.4,;-9.51,1.86,;-8.18,1.08,;-6.84,1.86,;-5.51,1.08,;-4.18,1.85,;-4.18,3.39,;-2.84,4.16,;-1.51,3.4,;-.18,4.17,;1.16,3.4,;2.49,4.17,;2.49,5.71,;1.16,6.48,;3.83,6.48,;5.16,5.71,;5.16,4.17,;3.83,3.39,;3.83,1.85,;1.16,1.86,;2.49,1.09,;-.18,1.09,;-.18,-.45,;-1.51,1.86,;-2.84,1.08,;-6.84,3.4,;-8.18,4.17,)|
Show InChI InChI=1S/C22H18Cl2N4O2/c1-3-30-15-9-7-14(8-10-15)26-22-25-12-13-11-16(21(29)28(2)20(13)27-22)19-17(23)5-4-6-18(19)24/h4-12H,3H2,1-2H3,(H,25,26,27)
NCI pathway
Reactome pathway
n/an/a 451n/an/an/an/a7.425
Parke-Davis Pharmaceutical Research
Assay Description
IC50 is the inhibitor concentration which inhibits 50% of kinase activity that catalyzes the transfer of the terminal phosphate from [gamma-32P] labe...
Biochem Pharmacol 60: 885-98 (2000)
Article DOI: 10.1016/s0006-2952(00)00405-6
BindingDB Entry DOI: 10.7270/Q2MC8X7B