BDBM6583 (5-Ethoxy-1H-2-indolyl)(1H-2-indolyl)methanone::5-ethoxy-2-(1H-indol-2-ylcarbonyl)-1H-indole::Bis(1H-2-indolyl)methanone 41
SMILES: CCOc1ccc2[nH]c(cc2c1)C(=O)c1cc2ccccc2[nH]1
InChI Key: InChIKey=RGOXESBZWFRLIB-UHFFFAOYSA-N
Data: 1 IC50
Activity Spreadsheet -- Enzyme Inhibition Constant Data from BindingDB
Found 1 hit for monomerid = 6583
Trg + Lig
Ki
nM
ΔG°
kcal/mole
IC50
nM
Kd
nM
EC50/IC50
nM
koff
s-1
kon
M-1s-1
pHTemp
°C
Platelet-derived growth factor receptor beta
(Homo sapiens (Human))
BDBM6583
((5-Ethoxy-1H-2-indolyl)(1H-2-indolyl)methanone | 5...)
Show SMILES CCOc1ccc2[nH]c(cc2c1)C(=O)c1cc2ccccc2[nH]1
Show InChI InChI=1S/C19H16N2O2/c1-2-23-14-7-8-16-13(9-14)11-18(21-16)19(22)17-10-12-5-3-4-6-15(12)20-17/h3-11,20-21H,2H2,1H3
NCI pathway
Reactome pathway
n/an/a 2.30E+3n/an/an/an/a7.422
University of Regensburg
Assay Description
The cells were stimulated with PDGF (100 ng/mL) for 10 min at room temperature. Then the cell lysates were analyzed by SDS-PAGE and immunoblotting wi...
J Med Chem 45: 1002-18 (2002)
Article DOI: 10.1021/jm010988n
BindingDB Entry DOI: 10.7270/Q2GM85H0