BDBM6589 2-(1H-indol-2-ylcarbonyl)-5-[(5-iodopentyl)oxy]-1H-indole::5-(5-Iodopentyloxy-1H-2-indolyl)-1H-2-indolylmethanone::Bis(1H-2-indolyl)methanone deriv. 47
SMILES: ICCCCCOc1ccc2[nH]c(cc2c1)C(=O)c1cc2ccccc2[nH]1
InChI Key: InChIKey=BPNCVKJYVNNMJL-UHFFFAOYSA-N
Data: 1 IC50
Activity Spreadsheet -- Enzyme Inhibition Constant Data from BindingDB
Found 1 hit for monomerid = 6589
Trg + Lig
Ki
nM
ΔG°
kcal/mole
IC50
nM
Kd
nM
EC50/IC50
nM
koff
s-1
kon
M-1s-1
pHTemp
°C
Platelet-derived growth factor receptor beta
(Homo sapiens (Human))
BDBM6589
(2-(1H-indol-2-ylcarbonyl)-5-[(5-iodopentyl)oxy]-1H...)
Show SMILES ICCCCCOc1ccc2[nH]c(cc2c1)C(=O)c1cc2ccccc2[nH]1
Show InChI InChI=1S/C22H21IN2O2/c23-10-4-1-5-11-27-17-8-9-19-16(12-17)14-21(25-19)22(26)20-13-15-6-2-3-7-18(15)24-20/h2-3,6-9,12-14,24-25H,1,4-5,10-11H2
NCI pathway
Reactome pathway
n/an/a>2.00E+4n/an/an/an/an/a25
University of Regensburg
Assay Description
The cells were stimulated with PDGF (100 ng/mL) for 10 min at room temperature. Then the cell lysates were analyzed by SDS-PAGE and immunoblotting wi...
J Med Chem 45: 1002-18 (2002)
Article DOI: 10.1021/jm010988n
BindingDB Entry DOI: 10.7270/Q2GM85H0