BDBM6604 2-(1H-indol-2-ylcarbonyl)-1H-indol-5-yl 2-chlorobenzoate::Bis(1H-2-indolyl)methanone deriv. 62::[2-(1H-2-Indolylcarbonyl)-1H-5-indolyl]-2-chlorobenzoate
SMILES: Clc1ccccc1C(=O)Oc1ccc2[nH]c(cc2c1)C(=O)c1cc2ccccc2[nH]1
InChI Key: InChIKey=PELIICSLIWRORX-UHFFFAOYSA-N
Data: 1 IC50
Activity Spreadsheet -- Enzyme Inhibition Constant Data from BindingDB
Found 1 hit for monomerid = 6604
Trg + Lig
Ki
nM
ΔG°
kcal/mole
IC50
nM
Kd
nM
EC50/IC50
nM
koff
s-1
kon
M-1s-1
pHTemp
°C
Platelet-derived growth factor receptor beta
(Homo sapiens (Human))
BDBM6604
(2-(1H-indol-2-ylcarbonyl)-1H-indol-5-yl 2-chlorobe...)
Show SMILES Clc1ccccc1C(=O)Oc1ccc2[nH]c(cc2c1)C(=O)c1cc2ccccc2[nH]1
Show InChI InChI=1S/C24H15ClN2O3/c25-18-7-3-2-6-17(18)24(29)30-16-9-10-20-15(11-16)13-22(27-20)23(28)21-12-14-5-1-4-8-19(14)26-21/h1-13,26-27H
NCI pathway
Reactome pathway
n/an/a 4.60E+3n/an/an/an/an/a25
University of Regensburg
Assay Description
The cells were stimulated with PDGF (100 ng/mL) for 10 min at room temperature. Then the cell lysates were analyzed by SDS-PAGE and immunoblotting wi...
J Med Chem 45: 1002-18 (2002)
Article DOI: 10.1021/jm010988n
BindingDB Entry DOI: 10.7270/Q2GM85H0