null
SMILES: COc1cc(C=c2c(=C)[nH]n(CCC#N)c2=O)c(Br)cc1OC(C)C
InChI Key: InChIKey=HYJHAGKFASQLFC-ZSOIEALJSA-N
Activity Spreadsheet -- Enzyme Inhibition Constant Data from BindingDB
Found 1 hit for monomerid = 66042
Trg + Lig
Ki
nM
ΔG°
kcal/mole
IC50
nM
Kd
nM
EC50/IC50
nM
koff
s-1
kon
M-1s-1
pHTemp
°C
Vacuolar aminopeptidase 1
(Saccharomyces cerevisiae)
BDBM66042
(3-[(4Z)-4-(2-bromo-4-isopropoxy-5-methoxy-benzylid...)
Show SMILES COc1cc(C=c2c(=C)[nH]n(CCC#N)c2=O)c(Br)cc1OC(C)C |w:5.4|
Show InChI InChI=1S/C18H20BrN3O3/c1-11(2)25-17-10-15(19)13(9-16(17)24-4)8-14-12(3)21-22(18(14)23)7-5-6-20/h8-11,21H,3,5,7H2,1-2,4H3/b14-8-
PCBioAssay
n/an/an/an/a 4.16E+3n/an/an/an/a
NMMLSC
Curated by PubChem BioAssay
Assay Description
University of New Mexico Assay Overview: Assay Support: 1R03 MH086450-01 Project Title: Chemical Screen of TOR pathway GFP fusion proteins in S. ...
PubChem Bioassay (2010)
BindingDB Entry DOI: 10.7270/Q21R6P02