BDBM6615 2-(1H-indol-2-ylcarbonyl)-1H-indol-5-yl 2,2-diphenylacetate::Bis(1H-2-indolyl)methanone deriv. 73::[2-(1H-2-Indolylcarbonyl)-1H-5-indolyl]diphenylethanoate
SMILES: O=C(Oc1ccc2[nH]c(cc2c1)C(=O)c1cc2ccccc2[nH]1)C(c1ccccc1)c1ccccc1
InChI Key: InChIKey=GTMAMZOWGONZHQ-UHFFFAOYSA-N
Data: 1 IC50
Activity Spreadsheet -- Enzyme Inhibition Constant Data from BindingDB
Found 1 hit for monomerid = 6615
Trg + Lig
Ki
nM
ΔG°
kcal/mole
IC50
nM
Kd
nM
EC50/IC50
nM
koff
s-1
kon
M-1s-1
pHTemp
°C
Platelet-derived growth factor receptor beta
(Homo sapiens (Human))
BDBM6615
(2-(1H-indol-2-ylcarbonyl)-1H-indol-5-yl 2,2-diphen...)
Show SMILES O=C(Oc1ccc2[nH]c(cc2c1)C(=O)c1cc2ccccc2[nH]1)C(c1ccccc1)c1ccccc1
Show InChI InChI=1S/C31H22N2O3/c34-30(27-18-22-13-7-8-14-25(22)32-27)28-19-23-17-24(15-16-26(23)33-28)36-31(35)29(20-9-3-1-4-10-20)21-11-5-2-6-12-21/h1-19,29,32-33H
NCI pathway
Reactome pathway
n/an/a>3.00E+4n/an/an/an/an/a25
University of Regensburg
Assay Description
The cells were stimulated with PDGF (100 ng/mL) for 10 min at room temperature. Then the cell lysates were analyzed by SDS-PAGE and immunoblotting wi...
J Med Chem 45: 1002-18 (2002)
Article DOI: 10.1021/jm010988n
BindingDB Entry DOI: 10.7270/Q2GM85H0