BDBM66184 6-[(4R,5S)-2-keto-5-methyl-imidazolidin-4-yl]hexanoic acid::6-[(4R,5S)-5-methyl-2-oxidanylidene-imidazolidin-4-yl]hexanoic acid::6-[(4R,5S)-5-methyl-2-oxo-4-imidazolidinyl]hexanoic acid::6-[(4R,5S)-5-methyl-2-oxoimidazolidin-4-yl]hexanoic acid::MLS001066403::SMR000471877::cid_445027::d-Desthiobiotin
SMILES: C[C@@H]1NC(=O)N[C@@H]1CCCCCC(O)=O
InChI Key: InChIKey=AUTOLBMXDDTRRT-JGVFFNPUSA-N
Data: 3 IC50
PDB links: 19 PDB IDs match this monomer.
Activity Spreadsheet -- Enzyme Inhibition Constant Data from BindingDB
Found 3 hits for monomerid = 66184
Trg + Lig
Ki
nM
ΔG°
kcal/mole
IC50
nM
Kd
nM
EC50/IC50
nM
koff
s-1
kon
M-1s-1
pHTemp
°C
photoreceptor-specific nuclear receptor
(Homo sapiens (Human))
BDBM66184
(6-[(4R,5S)-2-keto-5-methyl-imidazolidin-4-yl]hexan...)
Show SMILES C[C@@H]1NC(=O)N[C@@H]1CCCCCC(O)=O
Show InChI InChI=1S/C10H18N2O3/c1-7-8(12-10(15)11-7)5-3-2-4-6-9(13)14/h7-8H,2-6H2,1H3,(H,13,14)(H2,11,12,15)/t7-,8+/m0/s1
Reactome pathway
PCBioAssay
n/an/a 149n/an/an/an/an/an/a
The Scripps Research Institute Molecular Screening Center
Curated by PubChem BioAssay
Assay Description
Source (MLPCN Center Name): The Scripps Research Institute Molecular Screening Center Affiliation: The Scripps Research Institute, TSRI Assay Provide...
PubChem Bioassay (2010)
BindingDB Entry DOI: 10.7270/Q2D21W22
Tyrosine-protein kinase ABL1
(Homo sapiens (Human))
BDBM66184
(6-[(4R,5S)-2-keto-5-methyl-imidazolidin-4-yl]hexan...)
Show SMILES C[C@@H]1NC(=O)N[C@@H]1CCCCCC(O)=O
Show InChI InChI=1S/C10H18N2O3/c1-7-8(12-10(15)11-7)5-3-2-4-6-9(13)14/h7-8H,2-6H2,1H3,(H,13,14)(H2,11,12,15)/t7-,8+/m0/s1
Reactome pathway
PCBioAssay
n/an/a 10.1n/an/an/an/an/an/a
The Scripps Research Institute Molecular Screening Center
Curated by PubChem BioAssay
Assay Description
Source (MLPCN Center Name): The Scripps Research Institute Molecular Screening Center (SRIMSC) Affiliation: The Scripps Research Institute, TSRI Assa...
PubChem Bioassay (2012)
BindingDB Entry DOI: 10.7270/Q2RB736G
nuclear receptor corepressor 2 isoform 2
(Homo sapiens (Human))
BDBM66184
(6-[(4R,5S)-2-keto-5-methyl-imidazolidin-4-yl]hexan...)
Show SMILES C[C@@H]1NC(=O)N[C@@H]1CCCCCC(O)=O
Show InChI InChI=1S/C10H18N2O3/c1-7-8(12-10(15)11-7)5-3-2-4-6-9(13)14/h7-8H,2-6H2,1H3,(H,13,14)(H2,11,12,15)/t7-,8+/m0/s1
PCBioAssay
n/an/a 1.38E+3n/an/an/an/an/an/a
The Scripps Research Institute Molecular Screening Center
Curated by PubChem BioAssay
Assay Description
Source (MLPCN Center Name): The Scripps Research Institute Molecular Screening Center Affiliation: The Scripps Research Institute, TSRI Assay Provide...
PubChem Bioassay (2010)
BindingDB Entry DOI: 10.7270/Q28914BQ