BDBM66188 6-bromanyl-2-methyl-4-phenyl-quinoline-3-carboxylic acid::6-bromo-2-methyl-4-phenyl-3-quinolinecarboxylic acid::6-bromo-2-methyl-4-phenyl-quinoline-3-carboxylic acid::6-bromo-2-methyl-4-phenylquinoline-3-carboxylic acid::MLS001173402::SMR000538992::cid_757946
SMILES: Cc1nc2ccc(Br)cc2c(-c2ccccc2)c1C(O)=O
InChI Key: InChIKey=DLRRYGJBGBBQBK-UHFFFAOYSA-N
Data: 3 IC50
Activity Spreadsheet -- Enzyme Inhibition Constant Data from BindingDB
Found 3 hits for monomerid = 66188
Trg + Lig
Ki
nM
ΔG°
kcal/mole
IC50
nM
Kd
nM
EC50/IC50
nM
koff
s-1
kon
M-1s-1
pHTemp
°C
photoreceptor-specific nuclear receptor
(Homo sapiens (Human))
BDBM66188
(6-bromanyl-2-methyl-4-phenyl-quinoline-3-carboxyli...)
Show SMILES Cc1nc2ccc(Br)cc2c(-c2ccccc2)c1C(O)=O
Show InChI InChI=1S/C17H12BrNO2/c1-10-15(17(20)21)16(11-5-3-2-4-6-11)13-9-12(18)7-8-14(13)19-10/h2-9H,1H3,(H,20,21)
Reactome pathway
PCBioAssay
n/an/a 1.00E+3n/an/an/an/an/an/a
The Scripps Research Institute Molecular Screening Center
Curated by PubChem BioAssay
Assay Description
Source (MLPCN Center Name): The Scripps Research Institute Molecular Screening Center Affiliation: The Scripps Research Institute, TSRI Assay Provide...
PubChem Bioassay (2010)
BindingDB Entry DOI: 10.7270/Q2D21W22
Prion protein
(Homo sapiens (Human))
BDBM66188
(6-bromanyl-2-methyl-4-phenyl-quinoline-3-carboxyli...)
Show SMILES Cc1nc2ccc(Br)cc2c(-c2ccccc2)c1C(O)=O
Show InChI InChI=1S/C17H12BrNO2/c1-10-15(17(20)21)16(11-5-3-2-4-6-11)13-9-12(18)7-8-14(13)19-10/h2-9H,1H3,(H,20,21)
NCI pathway
Reactome pathway
PCBioAssay
n/an/a 5.47E+3n/an/an/an/an/an/a
The Scripps Research Institute Molecular Screening Center
Curated by PubChem BioAssay
Assay Description
Source (MLPCN Center Name): The Scripps Research Institute Molecular Screening Center (SRIMSC) Affiliation: The Scripps Research Institute, TSRI Assa...
PubChem Bioassay (2014)
BindingDB Entry DOI: 10.7270/Q2HM573M
nuclear receptor corepressor 2 isoform 2
(Homo sapiens (Human))
BDBM66188
(6-bromanyl-2-methyl-4-phenyl-quinoline-3-carboxyli...)
Show SMILES Cc1nc2ccc(Br)cc2c(-c2ccccc2)c1C(O)=O
Show InChI InChI=1S/C17H12BrNO2/c1-10-15(17(20)21)16(11-5-3-2-4-6-11)13-9-12(18)7-8-14(13)19-10/h2-9H,1H3,(H,20,21)
PCBioAssay
n/an/a 934n/an/an/an/an/an/a
The Scripps Research Institute Molecular Screening Center
Curated by PubChem BioAssay
Assay Description
Source (MLPCN Center Name): The Scripps Research Institute Molecular Screening Center Affiliation: The Scripps Research Institute, TSRI Assay Provide...
PubChem Bioassay (2010)
BindingDB Entry DOI: 10.7270/Q28914BQ