BDBM66193 7-(4-methoxyphenyl)-5-phenyl-4-pyrido[2,3-d]pyrimidinamine::7-(4-methoxyphenyl)-5-phenyl-pyrido[2,3-d]pyrimidin-4-amine::7-(4-methoxyphenyl)-5-phenylpyrido[2,3-d]pyrimidin-4-amine::MLS001181933::SMR000567698::[7-(4-methoxyphenyl)-5-phenyl-pyrido[2,3-d]pyrimidin-4-yl]amine::cid_2817025
SMILES: COc1ccc(cc1)-c1cc(-c2ccccc2)c2c(N)ncnc2n1
InChI Key: InChIKey=SBVNGLCANDMQEQ-UHFFFAOYSA-N
Data: 2 IC50  1 EC50
Activity Spreadsheet -- Enzyme Inhibition Constant Data from BindingDB
Found 3 hits for monomerid = 66193
Trg + Lig
Ki
nM
ΔG°
kcal/mole
IC50
nM
Kd
nM
EC50/IC50
nM
koff
s-1
kon
M-1s-1
pHTemp
°C
photoreceptor-specific nuclear receptor
(Homo sapiens (Human))
BDBM66193
(7-(4-methoxyphenyl)-5-phenyl-4-pyrido[2,3-d]pyrimi...)
Show SMILES COc1ccc(cc1)-c1cc(-c2ccccc2)c2c(N)ncnc2n1
Show InChI InChI=1S/C20H16N4O/c1-25-15-9-7-14(8-10-15)17-11-16(13-5-3-2-4-6-13)18-19(21)22-12-23-20(18)24-17/h2-12H,1H3,(H2,21,22,23,24)
Reactome pathway
PCBioAssay
n/an/a 220n/an/an/an/an/an/a
The Scripps Research Institute Molecular Screening Center
Curated by PubChem BioAssay
Assay Description
Source (MLPCN Center Name): The Scripps Research Institute Molecular Screening Center Affiliation: The Scripps Research Institute, TSRI Assay Provide...
PubChem Bioassay (2010)
BindingDB Entry DOI: 10.7270/Q2D21W22
Kallikrein 7
(Homo sapiens (Human))
BDBM66193
(7-(4-methoxyphenyl)-5-phenyl-4-pyrido[2,3-d]pyrimi...)
Show SMILES COc1ccc(cc1)-c1cc(-c2ccccc2)c2c(N)ncnc2n1
Show InChI InChI=1S/C20H16N4O/c1-25-15-9-7-14(8-10-15)17-11-16(13-5-3-2-4-6-13)18-19(21)22-12-23-20(18)24-17/h2-12H,1H3,(H2,21,22,23,24)
Reactome pathway
PCBioAssay
n/an/an/an/a>6.95E+4n/an/an/an/a
The Scripps Research Institute Molecular Screening Center
Curated by PubChem BioAssay
PubChem Bioassay (2013)
BindingDB Entry DOI: 10.7270/Q29G5KF0
nuclear receptor corepressor 2 isoform 2
(Homo sapiens (Human))
BDBM66193
(7-(4-methoxyphenyl)-5-phenyl-4-pyrido[2,3-d]pyrimi...)
Show SMILES COc1ccc(cc1)-c1cc(-c2ccccc2)c2c(N)ncnc2n1
Show InChI InChI=1S/C20H16N4O/c1-25-15-9-7-14(8-10-15)17-11-16(13-5-3-2-4-6-13)18-19(21)22-12-23-20(18)24-17/h2-12H,1H3,(H2,21,22,23,24)
PCBioAssay
n/an/a 237n/an/an/an/an/an/a
The Scripps Research Institute Molecular Screening Center
Curated by PubChem BioAssay
Assay Description
Source (MLPCN Center Name): The Scripps Research Institute Molecular Screening Center Affiliation: The Scripps Research Institute, TSRI Assay Provide...
PubChem Bioassay (2010)
BindingDB Entry DOI: 10.7270/Q28914BQ