BDBM6630 3-[(9bR)-5-oxo-1H,2H,3H,5H,9bH-benzo[a]pyrrolizin-9-yl]-1-{5-[(2S)-pyrrolidin-2-yl]-1H-pyrazol-3-yl}urea::N-[(9bR)-5-Oxo-2,3,5,9b-tetrahydro-1H-pyrrolo[2,1-a]isoindol-9-yl]-N -{5-[(2S)-pyrrolidin-2-yl]-1H-pyrazol-3-yl}urea::pyrazole-3-yl urea deriv. 14a
SMILES: O=C(Nc1cc(n[nH]1)[C@@H]1CCCN1)Nc1cccc2C(=O)N3CCC[C@@H]3c12
InChI Key: InChIKey=IWOOJEZSDPRYAZ-SWLSCSKDSA-N
Data: 3 IC50
PDB links: 1 PDB ID contains this monomer as substructures. 1 PDB ID contains inhibitors having a similarity of 90% to this monomer.
Activity Spreadsheet -- Enzyme Inhibition Constant Data from BindingDB
Found 3 hits for monomerid = 6630
Trg + Lig
Ki
nM
ΔG°
kcal/mole
IC50
nM
Kd
nM
EC50/IC50
nM
koff
s-1
kon
M-1s-1
pHTemp
°C
Cyclin-Dependent Kinase 2 (CDK2)
(Homo sapiens (Human))
BDBM6630
(3-[(9bR)-5-oxo-1H,2H,3H,5H,9bH-benzo[a]pyrrolizin-...)
Show SMILES O=C(Nc1cc(n[nH]1)[C@@H]1CCCN1)Nc1cccc2C(=O)N3CCC[C@@H]3c12 |r|
Show InChI InChI=1S/C19H22N6O2/c26-18-11-4-1-5-13(17(11)15-7-3-9-25(15)18)21-19(27)22-16-10-14(23-24-16)12-6-2-8-20-12/h1,4-5,10,12,15,20H,2-3,6-9H2,(H3,21,22,23,24,27)/t12-,15+/m0/s1
NCI pathway
Reactome pathway
n/an/a 2.50E+4n/an/an/an/an/an/a
Banyu Tsukuba Research Institute
Assay Description
In vitro kinase assays using synthetic peptides and purified enzymes were incubated at 30°C for 45 min in buffer that contained 50 uM ATP, and d...
J Med Chem 44: 4628-40 (2001)
Article DOI: 10.1021/jm010326y
BindingDB Entry DOI: 10.7270/Q2BV7DS8
3D
3D Structure (docked)
Cyclin-Dependent Kinase 4 (CDK4)
(Homo sapiens (Human))
BDBM6630
(3-[(9bR)-5-oxo-1H,2H,3H,5H,9bH-benzo[a]pyrrolizin-...)
Show SMILES O=C(Nc1cc(n[nH]1)[C@@H]1CCCN1)Nc1cccc2C(=O)N3CCC[C@@H]3c12 |r|
Show InChI InChI=1S/C19H22N6O2/c26-18-11-4-1-5-13(17(11)15-7-3-9-25(15)18)21-19(27)22-16-10-14(23-24-16)12-6-2-8-20-12/h1,4-5,10,12,15,20H,2-3,6-9H2,(H3,21,22,23,24,27)/t12-,15+/m0/s1
NCI pathway
Reactome pathway
n/an/a 220n/an/an/an/an/an/a
Banyu Tsukuba Research Institute
Assay Description
In vitro kinase assays using synthetic peptides and purified enzymes were incubated at 30°C for 45 min in buffer that contained 50 uM ATP, and d...
J Med Chem 44: 4628-40 (2001)
Article DOI: 10.1021/jm010326y
BindingDB Entry DOI: 10.7270/Q2BV7DS8
Cyclin-Dependent Kinase 1 (CDK1)
(Homo sapiens (Human))
BDBM6630
(3-[(9bR)-5-oxo-1H,2H,3H,5H,9bH-benzo[a]pyrrolizin-...)
Show SMILES O=C(Nc1cc(n[nH]1)[C@@H]1CCCN1)Nc1cccc2C(=O)N3CCC[C@@H]3c12 |r|
Show InChI InChI=1S/C19H22N6O2/c26-18-11-4-1-5-13(17(11)15-7-3-9-25(15)18)21-19(27)22-16-10-14(23-24-16)12-6-2-8-20-12/h1,4-5,10,12,15,20H,2-3,6-9H2,(H3,21,22,23,24,27)/t12-,15+/m0/s1
Reactome pathway
n/an/a 3.10E+4n/an/an/an/an/an/a
Banyu Tsukuba Research Institute
Assay Description
In vitro kinase assays using synthetic peptides and purified enzymes were incubated at 30°C for 45 min in buffer that contained 50 uM ATP, and d...
J Med Chem 44: 4628-40 (2001)
Article DOI: 10.1021/jm010326y
BindingDB Entry DOI: 10.7270/Q2BV7DS8