BDBM6689 (2E)-3-{2-amino-3-[(2,6-difluorophenyl)carbonyl]imidazo[1,2-a]pyridin-6-yl}-3-(2,6-difluorophenyl)prop-2-enenitrile::aminoimidazo[1,2-a]pyridine deriv. 26
SMILES: Nc1nc2ccc(cn2c1C(=O)c1c(F)cccc1F)C(=C/C#N)\c1c(F)cccc1F
InChI Key: InChIKey=CRXBYOWJISXKAI-UKTHLTGXSA-N
Data: 3 IC50
Activity Spreadsheet -- Enzyme Inhibition Constant Data from BindingDB
Found 3 hits for monomerid = 6689
Trg + Lig
Ki
nM
ΔG°
kcal/mole
IC50
nM
Kd
nM
EC50/IC50
nM
koff
s-1
kon
M-1s-1
pHTemp
°C
Cyclin-dependent kinase 2/G1/S-specific cyclin-E1
(Homo sapiens (Human))
BDBM6689
((2E)-3-{2-amino-3-[(2,6-difluorophenyl)carbonyl]im...)
Show SMILES Nc1nc2ccc(cn2c1C(=O)c1c(F)cccc1F)C(=C/C#N)\c1c(F)cccc1F
Show InChI InChI=1S/C23H12F4N4O/c24-14-3-1-4-15(25)19(14)13(9-10-28)12-7-8-18-30-23(29)21(31(18)11-12)22(32)20-16(26)5-2-6-17(20)27/h1-9,11H,29H2/b13-9+
n/an/a 160n/an/an/an/a7.022
Avenida de la Industria
Assay Description
In vitro CDK assay using purified enzyme, was incubated at room temperature with substrate, and test compounds in the presence of ATP/[gamma-33P]ATP....
Bioorg Med Chem Lett 14: 6095-9 (2004)
Article DOI: 10.1016/j.bmcl.2004.09.053
BindingDB Entry DOI: 10.7270/Q2ZP44BV
Cyclin-dependent kinase 4/G1/S-specific cyclin-D1
(Homo sapiens (Human))
BDBM6689
((2E)-3-{2-amino-3-[(2,6-difluorophenyl)carbonyl]im...)
Show SMILES Nc1nc2ccc(cn2c1C(=O)c1c(F)cccc1F)C(=C/C#N)\c1c(F)cccc1F
Show InChI InChI=1S/C23H12F4N4O/c24-14-3-1-4-15(25)19(14)13(9-10-28)12-7-8-18-30-23(29)21(31(18)11-12)22(32)20-16(26)5-2-6-17(20)27/h1-9,11H,29H2/b13-9+
NCI pathway
Reactome pathway
n/an/a 1.55E+3n/an/an/an/an/a25
Avenida de la Industria
Assay Description
In vitro CDK assay using purified enzyme, was incubated at room temperature with substrate, and test compounds in the presence of ATP/[gamma-33P]ATP....
Bioorg Med Chem Lett 14: 6095-9 (2004)
Article DOI: 10.1016/j.bmcl.2004.09.053
BindingDB Entry DOI: 10.7270/Q2ZP44BV
Cyclin-dependent kinase/G2/mitotic-specific cyclin- 1
(Homo sapiens (Human))
BDBM6689
((2E)-3-{2-amino-3-[(2,6-difluorophenyl)carbonyl]im...)
Show SMILES Nc1nc2ccc(cn2c1C(=O)c1c(F)cccc1F)C(=C/C#N)\c1c(F)cccc1F
Show InChI InChI=1S/C23H12F4N4O/c24-14-3-1-4-15(25)19(14)13(9-10-28)12-7-8-18-30-23(29)21(31(18)11-12)22(32)20-16(26)5-2-6-17(20)27/h1-9,11H,29H2/b13-9+
Reactome pathway
n/an/a 53n/an/an/an/an/a25
Avenida de la Industria
Assay Description
In vitro CDK assay using purified enzyme, was incubated at room temperature with substrate, and test compounds in the presence of ATP/[gamma-33P]ATP....
Bioorg Med Chem Lett 14: 6095-9 (2004)
Article DOI: 10.1016/j.bmcl.2004.09.053
BindingDB Entry DOI: 10.7270/Q2ZP44BV