BDBM66977 3-[(3S,5R,8R,9S,10S,13R,14S,17R)-10,13-dimethyl-3,14-bis(oxidanyl)-1,2,3,4,5,6,7,8,9,11,12,15,16,17-tetradecahydrocyclopenta[a]phenanthren-17-yl]-2H-furan-5-one::3-[(3S,5R,8R,9S,10S,13R,14S,17R)-3,14-dihydroxy-10,13-dimethyl-1,2,3,4,5,6,7,8,9,11,12,15,16,17-tetradecahydrocyclopenta[a]phenanthren-17-yl]-2H-furan-5-one::Digitoxigenin::MLS002153810::SMR001233182::cid_4369270
SMILES: C[C@]12CC[C@H]3[C@@H](CC[C@@H]4C[C@@H](O)CC[C@]34C)[C@@]1(O)CC[C@@H]2C1=CC(=O)OC1
InChI Key: InChIKey=XZTUSOXSLKTKJQ-CESUGQOBSA-N
Data: 3 IC50  1 EC50
PDB links: 3 PDB IDs match this monomer.
Activity Spreadsheet -- Enzyme Inhibition Constant Data from BindingDB
Found 4 hits for monomerid = 66977
Trg + Lig
Ki
nM
ΔG°
kcal/mole
IC50
nM
Kd
nM
EC50/IC50
nM
koff
s-1
kon
M-1s-1
pHTemp
°C
Bcl-2-like protein 11
(Homo sapiens (Human))
BDBM66977
(3-[(3S,5R,8R,9S,10S,13R,14S,17R)-10,13-dimethyl-3,...)
Show SMILES C[C@]12CC[C@H]3[C@@H](CC[C@@H]4C[C@@H](O)CC[C@]34C)[C@@]1(O)CC[C@@H]2C1=CC(=O)OC1 |t:25|
Show InChI InChI=1S/C23H34O4/c1-21-8-5-16(24)12-15(21)3-4-19-18(21)6-9-22(2)17(7-10-23(19,22)26)14-11-20(25)27-13-14/h11,15-19,24,26H,3-10,12-13H2,1-2H3/t15-,16+,17-,18+,19-,21+,22-,23+/m1/s1
Reactome pathway
PCBioAssay
n/an/an/an/a>3.50E+5n/an/an/an/a
Broad Institute
Curated by PubChem BioAssay
Assay Description
Keywords: apoptosis, BH3 domain, Bcl2-A1, BIM, caspase, cancer Primary Collaborator: Todd Golub, Broad Institute, golub@broadinstitute.org Assay Over...
PubChem Bioassay (2010)
BindingDB Entry DOI: 10.7270/Q24J0CKJ
Sodium/potassium-transporting ATPase alpha-1 chain
(Canis familiaris)
BDBM66977
(3-[(3S,5R,8R,9S,10S,13R,14S,17R)-10,13-dimethyl-3,...)
Show SMILES C[C@]12CC[C@H]3[C@@H](CC[C@@H]4C[C@@H](O)CC[C@]34C)[C@@]1(O)CC[C@@H]2C1=CC(=O)OC1 |t:25|
Show InChI InChI=1S/C23H34O4/c1-21-8-5-16(24)12-15(21)3-4-19-18(21)6-9-22(2)17(7-10-23(19,22)26)14-11-20(25)27-13-14/h11,15-19,24,26H,3-10,12-13H2,1-2H3/t15-,16+,17-,18+,19-,21+,22-,23+/m1/s1
n/an/a 500n/an/an/an/an/an/a
Prassis Istituto di Ricerche Sigma-Tau
Curated by ChEMBL
Assay Description
In vitro inhibitory concentration against dog kidney Na+,K+-ATPase
J Med Chem 43: 2332-49 (2000)
BindingDB Entry DOI: 10.7270/Q2KP82VV
Sodium/potassium-transporting ATPase alpha-1 chain
(Canis familiaris)
BDBM66977
(3-[(3S,5R,8R,9S,10S,13R,14S,17R)-10,13-dimethyl-3,...)
Show SMILES C[C@]12CC[C@H]3[C@@H](CC[C@@H]4C[C@@H](O)CC[C@]34C)[C@@]1(O)CC[C@@H]2C1=CC(=O)OC1 |t:25|
Show InChI InChI=1S/C23H34O4/c1-21-8-5-16(24)12-15(21)3-4-19-18(21)6-9-22(2)17(7-10-23(19,22)26)14-11-20(25)27-13-14/h11,15-19,24,26H,3-10,12-13H2,1-2H3/t15-,16+,17-,18+,19-,21+,22-,23+/m1/s1
n/an/a 500n/an/an/an/an/an/a
Prassis Istituto di Ricerche Sigma-Tau
Curated by ChEMBL
Assay Description
Inhibition of Na+/K+ ATPase from dog kidney
J Med Chem 40: 3484-8 (1997)
Article DOI: 10.1021/jm970312l
BindingDB Entry DOI: 10.7270/Q2SF2WVZ
Potassium-transporting ATPase alpha chain 2
(Homo sapiens (Human))
BDBM66977
(3-[(3S,5R,8R,9S,10S,13R,14S,17R)-10,13-dimethyl-3,...)
Show SMILES C[C@]12CC[C@H]3[C@@H](CC[C@@H]4C[C@@H](O)CC[C@]34C)[C@@]1(O)CC[C@@H]2C1=CC(=O)OC1 |t:25|
Show InChI InChI=1S/C23H34O4/c1-21-8-5-16(24)12-15(21)3-4-19-18(21)6-9-22(2)17(7-10-23(19,22)26)14-11-20(25)27-13-14/h11,15-19,24,26H,3-10,12-13H2,1-2H3/t15-,16+,17-,18+,19-,21+,22-,23+/m1/s1
Reactome pathway
n/an/a 80n/an/an/an/an/an/a
Prassis Istituto di Ricerche Sigma-Tau
Curated by ChEMBL
Assay Description
Compound was evaluated for its ability to inhibit the specific [3H]-ouabain binding to dog kidney Na+/K+ ATPase
J Med Chem 41: 3033-40 (1998)
Article DOI: 10.1021/jm980108d
BindingDB Entry DOI: 10.7270/Q2VX0H6K