BDBM6717 1,4,14,24-tetraazaheptacyclo[16.10.1.0^{2,17}.0^{3,11}.0^{5,10}.0^{12,16}.0^{22,29}]nonacosa-2(17),3(11),5(10),6,8,12(16),18(29),19,21-nonaene-13,15-dione hydrochloride::aza-1,7-annulated indole deriv. 28
SMILES: O=C1NC(=O)c2c1c1c3ccccc3[nH]c1c1n3CCCCNCc4cccc(c34)c21
InChI Key: InChIKey=HCHFQFVBCUYUIQ-UHFFFAOYSA-N
Data: 3 IC50
Activity Spreadsheet -- Enzyme Inhibition Constant Data from BindingDB
Found 3 hits for monomerid = 6717
Trg + Lig
Ki
nM
ΔG°
kcal/mole
IC50
nM
Kd
nM
EC50/IC50
nM
koff
s-1
kon
M-1s-1
pHTemp
°C
Cyclin-Dependent Kinase 4 (CDK4)
(Homo sapiens (Human))
BDBM6717
(1,4,14,24-tetraazaheptacyclo[16.10.1.0^{2,17}.0^{3...)
Show SMILES O=C1NC(=O)c2c1c1c3ccccc3[nH]c1c1n3CCCCNCc4cccc(c34)c21
Show InChI InChI=1S/C25H20N4O2/c30-24-19-17-14-7-1-2-9-16(14)27-21(17)23-18(20(19)25(31)28-24)15-8-5-6-13-12-26-10-3-4-11-29(23)22(13)15/h1-2,5-9,26-27H,3-4,10-12H2,(H,28,30,31)
NCI pathway
Reactome pathway
n/an/a 84n/an/an/an/a7.022
Lilly Research Laboratories
Assay Description
In vitro CDK assay using purified enzyme, was incubated at room temperature with substrate, and test compounds in the presence of ATP/[gamma-33P]ATP....
Bioorg Med Chem Lett 14: 3925-8 (2004)
Article DOI: 10.1016/j.bmcl.2004.05.088
BindingDB Entry DOI: 10.7270/Q2TX3CKP
cAMP-Dependent Protein Kinase (PKA)
(Bos taurus (bovine))
BDBM6717
(1,4,14,24-tetraazaheptacyclo[16.10.1.0^{2,17}.0^{3...)
Show SMILES O=C1NC(=O)c2c1c1c3ccccc3[nH]c1c1n3CCCCNCc4cccc(c34)c21
Show InChI InChI=1S/C25H20N4O2/c30-24-19-17-14-7-1-2-9-16(14)27-21(17)23-18(20(19)25(31)28-24)15-8-5-6-13-12-26-10-3-4-11-29(23)22(13)15/h1-2,5-9,26-27H,3-4,10-12H2,(H,28,30,31)
n/an/a 40n/an/an/an/an/a25
Lilly Research Laboratories
Assay Description
In vitro kinase assay using purified enzyme, was incubated at room temperature with substrate, and test compounds in the presence of ATP/[gamma-33P]A...
Bioorg Med Chem Lett 14: 3925-8 (2004)
Article DOI: 10.1016/j.bmcl.2004.05.088
BindingDB Entry DOI: 10.7270/Q2TX3CKP
CDK2/CycE
(Homo sapiens (Human))
BDBM6717
(1,4,14,24-tetraazaheptacyclo[16.10.1.0^{2,17}.0^{3...)
Show SMILES O=C1NC(=O)c2c1c1c3ccccc3[nH]c1c1n3CCCCNCc4cccc(c34)c21
Show InChI InChI=1S/C25H20N4O2/c30-24-19-17-14-7-1-2-9-16(14)27-21(17)23-18(20(19)25(31)28-24)15-8-5-6-13-12-26-10-3-4-11-29(23)22(13)15/h1-2,5-9,26-27H,3-4,10-12H2,(H,28,30,31)
n/an/a 200n/an/an/an/an/a25
Lilly Research Laboratories
Assay Description
In vitro kinase assay using purified enzyme, was incubated at room temperature with substrate, and test compounds in the presence of ATP/[gamma-33P]A...
Bioorg Med Chem Lett 14: 3925-8 (2004)
Article DOI: 10.1016/j.bmcl.2004.05.088
BindingDB Entry DOI: 10.7270/Q2TX3CKP