BDBM6735 1,7-Annulated indolocarbazole deriv. 16b::7-(azetidin-1-ylmethyl)-1,4,14-triazaheptacyclo[16.7.1.0^{2,17}.0^{3,11}.0^{5,10}.0^{12,16}.0^{22,26}]hexacosa-2(17),3(11),5(10),6,8,12(16),18(26),19,21-nonaene-13,15-dione
SMILES: O=C1NC(=O)c2c1c1c3ccc(CN4CCC4)cc3[nH]c1c1n3CCCc4cccc(c21)c34
InChI Key: InChIKey=LSBFODWZQBUGEH-UHFFFAOYSA-N
Data: 1 IC50
Activity Spreadsheet -- Enzyme Inhibition Constant Data from BindingDB
Found 1 hit for monomerid = 6735
Trg + Lig
Ki
nM
ΔG°
kcal/mole
IC50
nM
Kd
nM
EC50/IC50
nM
koff
s-1
kon
M-1s-1
pHTemp
°C
Cyclin-Dependent Kinase 4 (CDK4)
(Homo sapiens (Human))
BDBM6735
(1,7-Annulated indolocarbazole deriv. 16b | 7-(azet...)
Show SMILES O=C1NC(=O)c2c1c1c3ccc(CN4CCC4)cc3[nH]c1c1n3CCCc4cccc(c21)c34
Show InChI InChI=1S/C27H22N4O2/c32-26-21-19-16-8-7-14(13-30-9-3-10-30)12-18(16)28-23(19)25-20(22(21)27(33)29-26)17-6-1-4-15-5-2-11-31(25)24(15)17/h1,4,6-8,12,28H,2-3,5,9-11,13H2,(H,29,32,33)
NCI pathway
Reactome pathway
n/an/a 75n/an/an/an/a7.022
Lilly Research Laboratories
Assay Description
In vitro CDK assay using purified enzyme, was incubated at room temperature with substrate, and test compounds in the presence of ATP/[gamma-33P]ATP....
Bioorg Med Chem Lett 14: 3217-20 (2004)
Article DOI: 10.1016/j.bmcl.2004.03.105
BindingDB Entry DOI: 10.7270/Q2Q52MTT