BDBM6743 1,7-Annulated indolocarbazole deriv. 13Ba::24-(hydroxymethyl)-1,4,14-triazaheptacyclo[16.7.1.0^{2,17}.0^{3,11}.0^{5,10}.0^{12,16}.0^{22,26}]hexacosa-2(17),3(11),5(10),6,8,12(16),18(26),19,21-nonaene-13,15-dione
SMILES: OCC1Cc2cccc3c4c5C(=O)NC(=O)c5c5c6ccccc6[nH]c5c4n(C1)c23
InChI Key: InChIKey=WIDVEFIISQZZDC-UHFFFAOYSA-N
Data: 3 IC50
Activity Spreadsheet -- Enzyme Inhibition Constant Data from BindingDB
Found 3 hits for monomerid = 6743
Trg + Lig
Ki
nM
ΔG°
kcal/mole
IC50
nM
Kd
nM
EC50/IC50
nM
koff
s-1
kon
M-1s-1
pHTemp
°C
Cyclin-Dependent Kinase 4 (CDK4)
(Homo sapiens (Human))
BDBM6743
(1,7-Annulated indolocarbazole deriv. 13Ba | 24-(hy...)
Show SMILES OCC1Cc2cccc3c4c5C(=O)NC(=O)c5c5c6ccccc6[nH]c5c4n(C1)c23
Show InChI InChI=1S/C24H17N3O3/c28-10-11-8-12-4-3-6-14-17-19-18(23(29)26-24(19)30)16-13-5-1-2-7-15(13)25-20(16)22(17)27(9-11)21(12)14/h1-7,11,25,28H,8-10H2,(H,26,29,30)
NCI pathway
Reactome pathway
n/an/a 71n/an/an/an/a7.022
Lilly Research Laboratories
Assay Description
In vitro CDK assay using purified enzyme, was incubated at room temperature with substrate, and test compounds in the presence of ATP/[gamma-33P]ATP....
Bioorg Med Chem Lett 14: 3057-61 (2004)
Article DOI: 10.1016/j.bmcl.2004.04.033
BindingDB Entry DOI: 10.7270/Q2KD1W3H
cAMP-Dependent Protein Kinase (PKA)
(Bos taurus (bovine))
BDBM6743
(1,7-Annulated indolocarbazole deriv. 13Ba | 24-(hy...)
Show SMILES OCC1Cc2cccc3c4c5C(=O)NC(=O)c5c5c6ccccc6[nH]c5c4n(C1)c23
Show InChI InChI=1S/C24H17N3O3/c28-10-11-8-12-4-3-6-14-17-19-18(23(29)26-24(19)30)16-13-5-1-2-7-15(13)25-20(16)22(17)27(9-11)21(12)14/h1-7,11,25,28H,8-10H2,(H,26,29,30)
n/an/a>2.00E+3n/an/an/an/an/a25
Lilly Research Laboratories
Assay Description
In vitro assay using purified enzyme, was incubated at room temperature with substrate, and test compounds in the presence of ATP/[gamma-33P]ATP. 33P...
Bioorg Med Chem Lett 14: 3057-61 (2004)
Article DOI: 10.1016/j.bmcl.2004.04.033
BindingDB Entry DOI: 10.7270/Q2KD1W3H
CDK2/CycE
(Homo sapiens (Human))
BDBM6743
(1,7-Annulated indolocarbazole deriv. 13Ba | 24-(hy...)
Show SMILES OCC1Cc2cccc3c4c5C(=O)NC(=O)c5c5c6ccccc6[nH]c5c4n(C1)c23
Show InChI InChI=1S/C24H17N3O3/c28-10-11-8-12-4-3-6-14-17-19-18(23(29)26-24(19)30)16-13-5-1-2-7-15(13)25-20(16)22(17)27(9-11)21(12)14/h1-7,11,25,28H,8-10H2,(H,26,29,30)
n/an/a 217n/an/an/an/an/a25
Lilly Research Laboratories
Assay Description
In vitro assay using purified enzyme, was incubated at room temperature with substrate, and test compounds in the presence of ATP/[gamma-33P]ATP. 33P...
Bioorg Med Chem Lett 14: 3057-61 (2004)
Article DOI: 10.1016/j.bmcl.2004.04.033
BindingDB Entry DOI: 10.7270/Q2KD1W3H