BDBM6745 1,7-Annulated indolocarbazole deriv. 13Ab::7-fluoro-25-(hydroxymethyl)-1,4,14-triazaheptacyclo[16.7.1.0^{2,17}.0^{3,11}.0^{5,10}.0^{12,16}.0^{22,26}]hexacosa-2(17),3(11),5(10),6,8,12(16),18(26),19,21-nonaene-13,15-dione
SMILES: OCC1CCc2cccc3c4c5C(=O)NC(=O)c5c5c6ccc(F)cc6[nH]c5c4n1c23
InChI Key: InChIKey=OIWOJECTXFWECL-UHFFFAOYSA-N
Data: 3 IC50
Activity Spreadsheet -- Enzyme Inhibition Constant Data from BindingDB
Found 3 hits for monomerid = 6745
Trg + Lig
Ki
nM
ΔG°
kcal/mole
IC50
nM
Kd
nM
EC50/IC50
nM
koff
s-1
kon
M-1s-1
pHTemp
°C
Cyclin-Dependent Kinase 4 (CDK4)
(Homo sapiens (Human))
BDBM6745
(1,7-Annulated indolocarbazole deriv. 13Ab | 7-fluo...)
Show SMILES OCC1CCc2cccc3c4c5C(=O)NC(=O)c5c5c6ccc(F)cc6[nH]c5c4n1c23
Show InChI InChI=1S/C24H16FN3O3/c25-11-5-7-13-15(8-11)26-20-16(13)18-19(24(31)27-23(18)30)17-14-3-1-2-10-4-6-12(9-29)28(21(10)14)22(17)20/h1-3,5,7-8,12,26,29H,4,6,9H2,(H,27,30,31)
NCI pathway
Reactome pathway
n/an/a 2n/an/an/an/a7.022
Lilly Research Laboratories
Assay Description
In vitro CDK assay using purified enzyme, was incubated at room temperature with substrate, and test compounds in the presence of ATP/[gamma-33P]ATP....
Bioorg Med Chem Lett 14: 3057-61 (2004)
Article DOI: 10.1016/j.bmcl.2004.04.033
BindingDB Entry DOI: 10.7270/Q2KD1W3H
cAMP-Dependent Protein Kinase (PKA)
(Bos taurus (bovine))
BDBM6745
(1,7-Annulated indolocarbazole deriv. 13Ab | 7-fluo...)
Show SMILES OCC1CCc2cccc3c4c5C(=O)NC(=O)c5c5c6ccc(F)cc6[nH]c5c4n1c23
Show InChI InChI=1S/C24H16FN3O3/c25-11-5-7-13-15(8-11)26-20-16(13)18-19(24(31)27-23(18)30)17-14-3-1-2-10-4-6-12(9-29)28(21(10)14)22(17)20/h1-3,5,7-8,12,26,29H,4,6,9H2,(H,27,30,31)
n/an/a>2.00E+3n/an/an/an/an/a25
Lilly Research Laboratories
Assay Description
In vitro assay using purified enzyme, was incubated at room temperature with substrate, and test compounds in the presence of ATP/[gamma-33P]ATP. 33P...
Bioorg Med Chem Lett 14: 3057-61 (2004)
Article DOI: 10.1016/j.bmcl.2004.04.033
BindingDB Entry DOI: 10.7270/Q2KD1W3H
CDK2/CycE
(Homo sapiens (Human))
BDBM6745
(1,7-Annulated indolocarbazole deriv. 13Ab | 7-fluo...)
Show SMILES OCC1CCc2cccc3c4c5C(=O)NC(=O)c5c5c6ccc(F)cc6[nH]c5c4n1c23
Show InChI InChI=1S/C24H16FN3O3/c25-11-5-7-13-15(8-11)26-20-16(13)18-19(24(31)27-23(18)30)17-14-3-1-2-10-4-6-12(9-29)28(21(10)14)22(17)20/h1-3,5,7-8,12,26,29H,4,6,9H2,(H,27,30,31)
n/an/a 79n/an/an/an/an/a25
Lilly Research Laboratories
Assay Description
In vitro assay using purified enzyme, was incubated at room temperature with substrate, and test compounds in the presence of ATP/[gamma-33P]ATP. 33P...
Bioorg Med Chem Lett 14: 3057-61 (2004)
Article DOI: 10.1016/j.bmcl.2004.04.033
BindingDB Entry DOI: 10.7270/Q2KD1W3H