BDBM6747 1,7-Annulated indolocarbazole deriv. 13Bc::7-bromo-24-(hydroxymethyl)-1,4,14-triazaheptacyclo[16.7.1.0^{2,17}.0^{3,11}.0^{5,10}.0^{12,16}.0^{22,26}]hexacosa-2(17),3(11),5(10),6,8,12(16),18(26),19,21-nonaene-13,15-dione
SMILES: OCC1Cc2cccc3c4c5C(=O)NC(=O)c5c5c6ccc(Br)cc6[nH]c5c4n(C1)c23
InChI Key: InChIKey=WJKMSWAGLOGXLK-UHFFFAOYSA-N
Data: 3 IC50
Activity Spreadsheet -- Enzyme Inhibition Constant Data from BindingDB
Found 3 hits for monomerid = 6747
Trg + Lig
Ki
nM
ΔG°
kcal/mole
IC50
nM
Kd
nM
EC50/IC50
nM
koff
s-1
kon
M-1s-1
pHTemp
°C
Cyclin-Dependent Kinase 4 (CDK4)
(Homo sapiens (Human))
BDBM6747
(1,7-Annulated indolocarbazole deriv. 13Bc | 7-brom...)
Show SMILES OCC1Cc2cccc3c4c5C(=O)NC(=O)c5c5c6ccc(Br)cc6[nH]c5c4n(C1)c23
Show InChI InChI=1S/C24H16BrN3O3/c25-12-4-5-13-15(7-12)26-20-16(13)18-19(24(31)27-23(18)30)17-14-3-1-2-11-6-10(9-29)8-28(21(11)14)22(17)20/h1-5,7,10,26,29H,6,8-9H2,(H,27,30,31)
NCI pathway
Reactome pathway
n/an/a 10n/an/an/an/a7.022
Lilly Research Laboratories
Assay Description
In vitro CDK assay using purified enzyme, was incubated at room temperature with substrate, and test compounds in the presence of ATP/[gamma-33P]ATP....
Bioorg Med Chem Lett 14: 3057-61 (2004)
Article DOI: 10.1016/j.bmcl.2004.04.033
BindingDB Entry DOI: 10.7270/Q2KD1W3H
cAMP-Dependent Protein Kinase (PKA)
(Bos taurus (bovine))
BDBM6747
(1,7-Annulated indolocarbazole deriv. 13Bc | 7-brom...)
Show SMILES OCC1Cc2cccc3c4c5C(=O)NC(=O)c5c5c6ccc(Br)cc6[nH]c5c4n(C1)c23
Show InChI InChI=1S/C24H16BrN3O3/c25-12-4-5-13-15(7-12)26-20-16(13)18-19(24(31)27-23(18)30)17-14-3-1-2-11-6-10(9-29)8-28(21(11)14)22(17)20/h1-5,7,10,26,29H,6,8-9H2,(H,27,30,31)
n/an/a>2.00E+3n/an/an/an/an/a25
Lilly Research Laboratories
Assay Description
In vitro assay using purified enzyme, was incubated at room temperature with substrate, and test compounds in the presence of ATP/[gamma-33P]ATP. 33P...
Bioorg Med Chem Lett 14: 3057-61 (2004)
Article DOI: 10.1016/j.bmcl.2004.04.033
BindingDB Entry DOI: 10.7270/Q2KD1W3H
CDK2/CycE
(Homo sapiens (Human))
BDBM6747
(1,7-Annulated indolocarbazole deriv. 13Bc | 7-brom...)
Show SMILES OCC1Cc2cccc3c4c5C(=O)NC(=O)c5c5c6ccc(Br)cc6[nH]c5c4n(C1)c23
Show InChI InChI=1S/C24H16BrN3O3/c25-12-4-5-13-15(7-12)26-20-16(13)18-19(24(31)27-23(18)30)17-14-3-1-2-11-6-10(9-29)8-28(21(11)14)22(17)20/h1-5,7,10,26,29H,6,8-9H2,(H,27,30,31)
n/an/a>2.00E+3n/an/an/an/an/a25
Lilly Research Laboratories
Assay Description
In vitro assay using purified enzyme, was incubated at room temperature with substrate, and test compounds in the presence of ATP/[gamma-33P]ATP. 33P...
Bioorg Med Chem Lett 14: 3057-61 (2004)
Article DOI: 10.1016/j.bmcl.2004.04.033
BindingDB Entry DOI: 10.7270/Q2KD1W3H