BDBM6784 18-ethyl-3,13,18-triazahexacyclo[14.7.0.0^{2,10}.0^{4,9}.0^{11,15}.0^{17,21}]tricosa-1(16),2(10),4(9),5,7,11(15),17(21),19,22-nonaene-12,14-dione::indolo[6,7-a]pyrrolo[3,4-c]carbazole deriv. 3c
SMILES: CCn1ccc2ccc3c4[nH]c5ccccc5c4c4C(=O)NC(=O)c4c3c12
InChI Key: InChIKey=WHGJISNHJVBRGV-UHFFFAOYSA-N
Data: 3 IC50
PDB links: 1 PDB ID contains inhibitors having a similarity of 90% to this monomer.
Activity Spreadsheet -- Enzyme Inhibition Constant Data from BindingDB
Found 3 hits for monomerid = 6784
Trg + Lig
Ki
nM
ΔG°
kcal/mole
IC50
nM
Kd
nM
EC50/IC50
nM
koff
s-1
kon
M-1s-1
pHTemp
°C
Cyclin-Dependent Kinase 4 (CDK4)
(Homo sapiens (Human))
BDBM6784
(18-ethyl-3,13,18-triazahexacyclo[14.7.0.0^{2,10}.0...)
Show SMILES CCn1ccc2ccc3c4[nH]c5ccccc5c4c4C(=O)NC(=O)c4c3c12
Show InChI InChI=1S/C22H15N3O2/c1-2-25-10-9-11-7-8-13-16(20(11)25)18-17(21(26)24-22(18)27)15-12-5-3-4-6-14(12)23-19(13)15/h3-10,23H,2H2,1H3,(H,24,26,27)
NCI pathway
Reactome pathway
n/an/a 59n/an/an/an/a7.022
Lilly Research Laboratories
Assay Description
In vitro CDK assay using purified enzyme, was incubated at room temperature with substrate, and test compounds in the presence of ATP/[gamma-33P]ATP....
Bioorg Med Chem Lett 13: 2261-7 (2003)
Article DOI: 10.1016/s0960-894x(03)00461-x
BindingDB Entry DOI: 10.7270/Q29W0CPW
cAMP-Dependent Protein Kinase (PKA)
(Bos taurus (bovine))
BDBM6784
(18-ethyl-3,13,18-triazahexacyclo[14.7.0.0^{2,10}.0...)
Show SMILES CCn1ccc2ccc3c4[nH]c5ccccc5c4c4C(=O)NC(=O)c4c3c12
Show InChI InChI=1S/C22H15N3O2/c1-2-25-10-9-11-7-8-13-16(20(11)25)18-17(21(26)24-22(18)27)15-12-5-3-4-6-14(12)23-19(13)15/h3-10,23H,2H2,1H3,(H,24,26,27)
n/an/a>2.00E+3n/an/an/an/an/a25
Lilly Research Laboratories
Assay Description
In vitro kinase assay using purified enzyme, was incubated at room temperature with substrate, and test compounds in the presence of ATP/[gamma-33P]A...
Bioorg Med Chem Lett 13: 2261-7 (2003)
Article DOI: 10.1016/s0960-894x(03)00461-x
BindingDB Entry DOI: 10.7270/Q29W0CPW
Cyclin-Dependent Kinase 4 (CDK4)
(Homo sapiens (Human))
BDBM6784
(18-ethyl-3,13,18-triazahexacyclo[14.7.0.0^{2,10}.0...)
Show SMILES CCn1ccc2ccc3c4[nH]c5ccccc5c4c4C(=O)NC(=O)c4c3c12
Show InChI InChI=1S/C22H15N3O2/c1-2-25-10-9-11-7-8-13-16(20(11)25)18-17(21(26)24-22(18)27)15-12-5-3-4-6-14(12)23-19(13)15/h3-10,23H,2H2,1H3,(H,24,26,27)
NCI pathway
Reactome pathway
n/an/a 19n/an/an/an/an/a25
Lilly Research Laboratories
Assay Description
In vitro CDK assay using purified enzyme, was incubated at room temperature with substrate, and test compounds in the presence of ATP/[gamma-33P]ATP....
Bioorg Med Chem Lett 13: 2261-7 (2003)
Article DOI: 10.1016/s0960-894x(03)00461-x
BindingDB Entry DOI: 10.7270/Q29W0CPW