null
SMILES: CC1CCN(CC1)S(=O)(=O)c1ccc-2c(c1)C(N=O)c1cc(ccc-21)S(=O)(=O)N1CCC(C)CC1
InChI Key: InChIKey=OUHFDYCYGUYBFK-UHFFFAOYSA-N
Activity Spreadsheet -- Enzyme Inhibition Constant Data from BindingDB
Found 4 hits for monomerid = 67846
Trg + Lig
Ki
nM
ΔG°
kcal/mole
IC50
nM
Kd
nM
EC50/IC50
nM
koff
s-1
kon
M-1s-1
pHTemp
°C
DNA damage-inducible transcript 3 protein
(Mus musculus)
BDBM67846
(2,7-Bis-(4-methyl-piperidine-1-sulfonyl)-fluoren-9...)
Show SMILES CC1CCN(CC1)S(=O)(=O)c1ccc-2c(c1)C(N=O)c1cc(ccc-21)S(=O)(=O)N1CCC(C)CC1
Show InChI InChI=1S/C25H31N3O5S2/c1-17-7-11-27(12-8-17)34(30,31)19-3-5-21-22-6-4-20(16-24(22)25(26-29)23(21)15-19)35(32,33)28-13-9-18(2)10-14-28/h3-6,15-18,25H,7-14H2,1-2H3
PCBioAssay
n/an/a 290n/an/an/an/an/an/a
Emory University Molecular Libraries Screening Center
Curated by PubChem BioAssay
Assay Description
NIH Molecular Libraries Screening Centers Network [MLSCN] Emory Chemical Biology Discovery Center in MLSCN Assay provider: Dr. Randal Kaufman, Univer...
PubChem Bioassay (2010)
BindingDB Entry DOI: 10.7270/Q2PC30VZ
Orotidine 5'-phosphate decarboxylase
(Aspergillus niger)
BDBM67846
(2,7-Bis-(4-methyl-piperidine-1-sulfonyl)-fluoren-9...)
Show SMILES CC1CCN(CC1)S(=O)(=O)c1ccc-2c(c1)C(N=O)c1cc(ccc-21)S(=O)(=O)N1CCC(C)CC1
Show InChI InChI=1S/C25H31N3O5S2/c1-17-7-11-27(12-8-17)34(30,31)19-3-5-21-22-6-4-20(16-24(22)25(26-29)23(21)15-19)35(32,33)28-13-9-18(2)10-14-28/h3-6,15-18,25H,7-14H2,1-2H3
PCBioAssay
n/an/an/an/a>5.96E+4n/an/an/an/a
The Scripps Research Institute Molecular Screening Center
Curated by PubChem BioAssay
Assay Description
Source (MLPCN Center Name): The Scripps Research Institute Molecular Screening Center (SRISMC) Center Affiliation: The Scripps Research Institute, TS...
PubChem Bioassay (2011)
BindingDB Entry DOI: 10.7270/Q2PK0DN5
DNA damage-inducible transcript 3 protein
(Mus musculus)
BDBM67846
(2,7-Bis-(4-methyl-piperidine-1-sulfonyl)-fluoren-9...)
Show SMILES CC1CCN(CC1)S(=O)(=O)c1ccc-2c(c1)C(N=O)c1cc(ccc-21)S(=O)(=O)N1CCC(C)CC1
Show InChI InChI=1S/C25H31N3O5S2/c1-17-7-11-27(12-8-17)34(30,31)19-3-5-21-22-6-4-20(16-24(22)25(26-29)23(21)15-19)35(32,33)28-13-9-18(2)10-14-28/h3-6,15-18,25H,7-14H2,1-2H3
PCBioAssay
n/an/a 290n/an/an/an/an/an/a
Emory University Molecular Libraries Screening Center
Curated by PubChem BioAssay
Assay Description
NIH Molecular Libraries Screening Centers Network [MLSCN] Emory Chemical Biology Discovery Center in MLSCN Assay provider: Dr. Randal Kaufman, Univer...
PubChem Bioassay (2011)
BindingDB Entry DOI: 10.7270/Q28C9TQN
X-box-binding protein 1
(Homo sapiens (Human))
BDBM67846
(2,7-Bis-(4-methyl-piperidine-1-sulfonyl)-fluoren-9...)
Show SMILES CC1CCN(CC1)S(=O)(=O)c1ccc-2c(c1)C(N=O)c1cc(ccc-21)S(=O)(=O)N1CCC(C)CC1
Show InChI InChI=1S/C25H31N3O5S2/c1-17-7-11-27(12-8-17)34(30,31)19-3-5-21-22-6-4-20(16-24(22)25(26-29)23(21)15-19)35(32,33)28-13-9-18(2)10-14-28/h3-6,15-18,25H,7-14H2,1-2H3
PCBioAssay
n/an/a 1.20E+3n/an/an/an/an/an/a
Emory University Molecular Libraries Screening Center
Curated by PubChem BioAssay
Assay Description
NIH Molecular Libraries Screening Centers Network [MLSCN] Emory Chemical Biology Discovery Center in MLSCN Assay provider: Dr. Randal Kaufman, Univer...
PubChem Bioassay (2011)
BindingDB Entry DOI: 10.7270/Q2NK3CGB