BDBM6813 23-methoxy-18-methyl-3,13,18-triazahexacyclo[14.7.0.0^{2,10}.0^{4,9}.0^{11,15}.0^{17,21}]tricosa-1(16),2(10),4(9),5,7,11(15),17(21),19,22-nonaene-12,14-dione::indolo[6,7-a]pyrrolo[3,4-c]carbazole deriv. 3ff
SMILES: COc1cc2ccn(C)c2c2c3C(=O)NC(=O)c3c3c4ccccc4[nH]c3c12
InChI Key: InChIKey=UOJGFXJJJQZLMH-UHFFFAOYSA-N
Data: 3 IC50
Activity Spreadsheet -- Enzyme Inhibition Constant Data from BindingDB
Found 3 hits for monomerid = 6813
Trg + Lig
Ki
nM
ΔG°
kcal/mole
IC50
nM
Kd
nM
EC50/IC50
nM
koff
s-1
kon
M-1s-1
pHTemp
°C
Cyclin-Dependent Kinase 4 (CDK4)
(Homo sapiens (Human))
BDBM6813
(23-methoxy-18-methyl-3,13,18-triazahexacyclo[14.7....)
Show SMILES COc1cc2ccn(C)c2c2c3C(=O)NC(=O)c3c3c4ccccc4[nH]c3c12
Show InChI InChI=1S/C22H15N3O3/c1-25-8-7-10-9-13(28-2)15-16(20(10)25)18-17(21(26)24-22(18)27)14-11-5-3-4-6-12(11)23-19(14)15/h3-9,23H,1-2H3,(H,24,26,27)
NCI pathway
Reactome pathway
n/an/a 32n/an/an/an/an/a25
Lilly Research Laboratories
Assay Description
In vitro CDK assay using purified enzyme, was incubated at room temperature with substrate, and test compounds in the presence of ATP/[gamma-33P]ATP....
Bioorg Med Chem Lett 13: 2261-7 (2003)
Article DOI: 10.1016/s0960-894x(03)00461-x
BindingDB Entry DOI: 10.7270/Q29W0CPW
CDK2/CycE
(Homo sapiens (Human))
BDBM6813
(23-methoxy-18-methyl-3,13,18-triazahexacyclo[14.7....)
Show SMILES COc1cc2ccn(C)c2c2c3C(=O)NC(=O)c3c3c4ccccc4[nH]c3c12
Show InChI InChI=1S/C22H15N3O3/c1-25-8-7-10-9-13(28-2)15-16(20(10)25)18-17(21(26)24-22(18)27)14-11-5-3-4-6-12(11)23-19(14)15/h3-9,23H,1-2H3,(H,24,26,27)
n/an/a 67n/an/an/an/an/a25
Lilly Research Laboratories
Assay Description
In vitro CDK assay using purified enzyme, was incubated at room temperature with substrate, and test compounds in the presence of ATP/[gamma-33P]ATP....
Bioorg Med Chem Lett 13: 2261-7 (2003)
Article DOI: 10.1016/s0960-894x(03)00461-x
BindingDB Entry DOI: 10.7270/Q29W0CPW
Cyclin-Dependent Kinase 4 (CDK4)
(Homo sapiens (Human))
BDBM6813
(23-methoxy-18-methyl-3,13,18-triazahexacyclo[14.7....)
Show SMILES COc1cc2ccn(C)c2c2c3C(=O)NC(=O)c3c3c4ccccc4[nH]c3c12
Show InChI InChI=1S/C22H15N3O3/c1-25-8-7-10-9-13(28-2)15-16(20(10)25)18-17(21(26)24-22(18)27)14-11-5-3-4-6-12(11)23-19(14)15/h3-9,23H,1-2H3,(H,24,26,27)
NCI pathway
Reactome pathway
n/an/a 18n/an/an/an/an/a25
Lilly Research Laboratories
Assay Description
In vitro CDK assay using purified enzyme, was incubated at room temperature with substrate, and test compounds in the presence of ATP/[gamma-33P]ATP....
Bioorg Med Chem Lett 13: 2261-7 (2003)
Article DOI: 10.1016/s0960-894x(03)00461-x
BindingDB Entry DOI: 10.7270/Q29W0CPW